BDBM50395235 CHEMBL2164670
SMILES: COc1ccccc1C(NC(=O)[C@@H]1CCCC[C@H]1C(=O)N1CCN(Cc2ccc(F)cc2)CC1)C#N
InChI Key: InChIKey=VBPPTMDMNMVDMW-PSJAQFSKSA-N
Data: 2 IC50
Activity Spreadsheet -- Enzyme Inhibition Constant Data from BindingDB
Found 2 hits for monomerid = 50395235
Trg + Lig
Ki
nM
ΔG°
kcal/mole
IC50
nM
Kd
nM
EC50/IC50
nM
koff
s-1
kon
M-1s-1
pHTemp
°C
Cathepsin S
(Homo sapiens (Human))
BDBM50395235
(CHEMBL2164670)
Show SMILES COc1ccccc1C(NC(=O)[C@@H]1CCCC[C@H]1C(=O)N1CCN(Cc2ccc(F)cc2)CC1)C#N |r|
Show InChI InChI=1S/C28H33FN4O3/c1-36-26-9-5-4-8-24(26)25(18-30)31-27(34)22-6-2-3-7-23(22)28(35)33-16-14-32(15-17-33)19-20-10-12-21(29)13-11-20/h4-5,8-13,22-23,25H,2-3,6-7,14-17,19H2,1H3,(H,31,34)/t22-,23-,25?/m1/s1
Reactome pathway
n/an/a 76n/an/an/an/an/an/a
AstraZeneca
Curated by ChEMBL
Assay Description
Inhibition of human recombinant CatS assessed as suppression of enzyme-mediated Z-Val-Val-Arg-AMC cleavage by QFRET assay
J Med Chem 55: 6363-74 (2012)
Article DOI: 10.1021/jm3007257
BindingDB Entry DOI: 10.7270/Q2833T5F
Cathepsin K
(Homo sapiens (Human))
BDBM50395235
(CHEMBL2164670)
Show SMILES COc1ccccc1C(NC(=O)[C@@H]1CCCC[C@H]1C(=O)N1CCN(Cc2ccc(F)cc2)CC1)C#N |r|
Show InChI InChI=1S/C28H33FN4O3/c1-36-26-9-5-4-8-24(26)25(18-30)31-27(34)22-6-2-3-7-23(22)28(35)33-16-14-32(15-17-33)19-20-10-12-21(29)13-11-20/h4-5,8-13,22-23,25H,2-3,6-7,14-17,19H2,1H3,(H,31,34)/t22-,23-,25?/m1/s1
Reactome pathway
n/an/a 1n/an/an/an/an/an/a
AstraZeneca
Curated by ChEMBL
Assay Description
Inhibition of human recombinant CatK assessed as suppression of enzyme-mediated Z-Phe-Arg-AMC cleavage incubated for 1 hrs by QFRET assay
J Med Chem 55: 6363-74 (2012)
Article DOI: 10.1021/jm3007257
BindingDB Entry DOI: 10.7270/Q2833T5F