BDBM50395236 CHEMBL2163360
SMILES: O=C(NC1(CC1)C#N)[C@@H]1CCCC[C@H]1C(=O)N1CCc2[nH]c3ncccc3c2C1
InChI Key: InChIKey=QNQMLBYWCKPFEB-HZPDHXFCSA-N
Data: 3 IC50
Activity Spreadsheet -- Enzyme Inhibition Constant Data from BindingDB
Found 3 hits for monomerid = 50395236
Trg + Lig
Ki
nM
ΔG°
kcal/mole
IC50
nM
Kd
nM
EC50/IC50
nM
koff
s-1
kon
M-1s-1
pHTemp
°C
Cathepsin K
(Homo sapiens (Human))
BDBM50395236
(CHEMBL2163360)
Show SMILES O=C(NC1(CC1)C#N)[C@@H]1CCCC[C@H]1C(=O)N1CCc2[nH]c3ncccc3c2C1 |r|
Show InChI InChI=1S/C22H25N5O2/c23-13-22(8-9-22)26-20(28)15-4-1-2-5-16(15)21(29)27-11-7-18-17(12-27)14-6-3-10-24-19(14)25-18/h3,6,10,15-16H,1-2,4-5,7-9,11-12H2,(H,24,25)(H,26,28)/t15-,16-/m1/s1
Reactome pathway
n/an/a 1n/an/an/an/an/an/a
AstraZeneca
Curated by ChEMBL
Assay Description
Inhibition of human recombinant CatK assessed as suppression of enzyme-mediated Z-Phe-Arg-AMC cleavage incubated for 1 hrs by QFRET assay
J Med Chem 55: 6363-74 (2012)
Article DOI: 10.1021/jm3007257
BindingDB Entry DOI: 10.7270/Q2833T5F
Cathepsin S
(Homo sapiens (Human))
BDBM50395236
(CHEMBL2163360)
Show SMILES O=C(NC1(CC1)C#N)[C@@H]1CCCC[C@H]1C(=O)N1CCc2[nH]c3ncccc3c2C1 |r|
Show InChI InChI=1S/C22H25N5O2/c23-13-22(8-9-22)26-20(28)15-4-1-2-5-16(15)21(29)27-11-7-18-17(12-27)14-6-3-10-24-19(14)25-18/h3,6,10,15-16H,1-2,4-5,7-9,11-12H2,(H,24,25)(H,26,28)/t15-,16-/m1/s1
Reactome pathway
n/an/a>4.00E+3n/an/an/an/an/an/a
AstraZeneca
Curated by ChEMBL
Assay Description
Inhibition of human recombinant CatS assessed as suppression of enzyme-mediated Z-Val-Val-Arg-AMC cleavage by QFRET assay
J Med Chem 55: 6363-74 (2012)
Article DOI: 10.1021/jm3007257
BindingDB Entry DOI: 10.7270/Q2833T5F
Cathepsin B
(Homo sapiens (Human))
BDBM50395236
(CHEMBL2163360)
Show SMILES O=C(NC1(CC1)C#N)[C@@H]1CCCC[C@H]1C(=O)N1CCc2[nH]c3ncccc3c2C1 |r|
Show InChI InChI=1S/C22H25N5O2/c23-13-22(8-9-22)26-20(28)15-4-1-2-5-16(15)21(29)27-11-7-18-17(12-27)14-6-3-10-24-19(14)25-18/h3,6,10,15-16H,1-2,4-5,7-9,11-12H2,(H,24,25)(H,26,28)/t15-,16-/m1/s1
Reactome pathway
n/an/a>2.90E+3n/an/an/an/an/an/a
AstraZeneca
Curated by ChEMBL
Assay Description
Inhibition of human recombinant CatB assessed as suppression of enzyme-mediated Z-Arg-Arg-AMC cleavage by QFRET assay
J Med Chem 55: 6363-74 (2012)
Article DOI: 10.1021/jm3007257
BindingDB Entry DOI: 10.7270/Q2833T5F