BDBM50395239 CHEMBL2163588
SMILES: CSc1cccc2c3CN(CCc3[nH]c12)C(=O)[C@@H]1CCCC[C@H]1C(=O)NC1(CC1)C#N
InChI Key: InChIKey=IAKLMYSRERBHEH-IAGOWNOFSA-N
Data: 3 IC50
Activity Spreadsheet -- Enzyme Inhibition Constant Data from BindingDB
Found 3 hits for monomerid = 50395239
Trg + Lig
Ki
nM
ΔG°
kcal/mole
IC50
nM
Kd
nM
EC50/IC50
nM
koff
s-1
kon
M-1s-1
pHTemp
°C
Cathepsin K
(Homo sapiens (Human))
BDBM50395239
(CHEMBL2163588)
Show SMILES CSc1cccc2c3CN(CCc3[nH]c12)C(=O)[C@@H]1CCCC[C@H]1C(=O)NC1(CC1)C#N |r|
Show InChI InChI=1S/C24H28N4O2S/c1-31-20-8-4-7-15-18-13-28(12-9-19(18)26-21(15)20)23(30)17-6-3-2-5-16(17)22(29)27-24(14-25)10-11-24/h4,7-8,16-17,26H,2-3,5-6,9-13H2,1H3,(H,27,29)/t16-,17-/m1/s1
Reactome pathway
n/an/a 4n/an/an/an/an/an/a
AstraZeneca
Curated by ChEMBL
Assay Description
Inhibition of human recombinant CatK assessed as suppression of enzyme-mediated Z-Phe-Arg-AMC cleavage incubated for 1 hrs by QFRET assay
J Med Chem 55: 6363-74 (2012)
Article DOI: 10.1021/jm3007257
BindingDB Entry DOI: 10.7270/Q2833T5F
Cathepsin S
(Homo sapiens (Human))
BDBM50395239
(CHEMBL2163588)
Show SMILES CSc1cccc2c3CN(CCc3[nH]c12)C(=O)[C@@H]1CCCC[C@H]1C(=O)NC1(CC1)C#N |r|
Show InChI InChI=1S/C24H28N4O2S/c1-31-20-8-4-7-15-18-13-28(12-9-19(18)26-21(15)20)23(30)17-6-3-2-5-16(17)22(29)27-24(14-25)10-11-24/h4,7-8,16-17,26H,2-3,5-6,9-13H2,1H3,(H,27,29)/t16-,17-/m1/s1
Reactome pathway
n/an/a>4.00E+3n/an/an/an/an/an/a
AstraZeneca
Curated by ChEMBL
Assay Description
Inhibition of human recombinant CatS assessed as suppression of enzyme-mediated Z-Val-Val-Arg-AMC cleavage by QFRET assay
J Med Chem 55: 6363-74 (2012)
Article DOI: 10.1021/jm3007257
BindingDB Entry DOI: 10.7270/Q2833T5F
Cathepsin B
(Homo sapiens (Human))
BDBM50395239
(CHEMBL2163588)
Show SMILES CSc1cccc2c3CN(CCc3[nH]c12)C(=O)[C@@H]1CCCC[C@H]1C(=O)NC1(CC1)C#N |r|
Show InChI InChI=1S/C24H28N4O2S/c1-31-20-8-4-7-15-18-13-28(12-9-19(18)26-21(15)20)23(30)17-6-3-2-5-16(17)22(29)27-24(14-25)10-11-24/h4,7-8,16-17,26H,2-3,5-6,9-13H2,1H3,(H,27,29)/t16-,17-/m1/s1
Reactome pathway
n/an/a>2.90E+3n/an/an/an/an/an/a
AstraZeneca
Curated by ChEMBL
Assay Description
Inhibition of human recombinant CatB assessed as suppression of enzyme-mediated Z-Arg-Arg-AMC cleavage by QFRET assay
J Med Chem 55: 6363-74 (2012)
Article DOI: 10.1021/jm3007257
BindingDB Entry DOI: 10.7270/Q2833T5F