BDBM50395254 CHEMBL2164682
SMILES: O=C(NC1(CC1)C#N)[C@@H]1CCCC[C@H]1C(=O)N1CCc2[nH]c3ccccc3c2C1
InChI Key: InChIKey=YOIFKTNHQMFUDH-IAGOWNOFSA-N
Data: 3 IC50
Activity Spreadsheet -- Enzyme Inhibition Constant Data from BindingDB
Found 3 hits for monomerid = 50395254
Trg + Lig
Ki
nM
ΔG°
kcal/mole
IC50
nM
Kd
nM
EC50/IC50
nM
koff
s-1
kon
M-1s-1
pHTemp
°C
Cathepsin K
(Homo sapiens (Human))
BDBM50395254
(CHEMBL2164682)
Show SMILES O=C(NC1(CC1)C#N)[C@@H]1CCCC[C@H]1C(=O)N1CCc2[nH]c3ccccc3c2C1 |r|
Show InChI InChI=1S/C23H26N4O2/c24-14-23(10-11-23)26-21(28)16-6-1-2-7-17(16)22(29)27-12-9-20-18(13-27)15-5-3-4-8-19(15)25-20/h3-5,8,16-17,25H,1-2,6-7,9-13H2,(H,26,28)/t16-,17-/m1/s1
Reactome pathway
n/an/a 1n/an/an/an/an/an/a
AstraZeneca
Curated by ChEMBL
Assay Description
Inhibition of human recombinant CatK assessed as suppression of enzyme-mediated Z-Phe-Arg-AMC cleavage incubated for 1 hrs by QFRET assay
J Med Chem 55: 6363-74 (2012)
Article DOI: 10.1021/jm3007257
BindingDB Entry DOI: 10.7270/Q2833T5F
Cathepsin S
(Homo sapiens (Human))
BDBM50395254
(CHEMBL2164682)
Show SMILES O=C(NC1(CC1)C#N)[C@@H]1CCCC[C@H]1C(=O)N1CCc2[nH]c3ccccc3c2C1 |r|
Show InChI InChI=1S/C23H26N4O2/c24-14-23(10-11-23)26-21(28)16-6-1-2-7-17(16)22(29)27-12-9-20-18(13-27)15-5-3-4-8-19(15)25-20/h3-5,8,16-17,25H,1-2,6-7,9-13H2,(H,26,28)/t16-,17-/m1/s1
Reactome pathway
n/an/a>4.00E+3n/an/an/an/an/an/a
AstraZeneca
Curated by ChEMBL
Assay Description
Inhibition of human recombinant CatS assessed as suppression of enzyme-mediated Z-Val-Val-Arg-AMC cleavage by QFRET assay
J Med Chem 55: 6363-74 (2012)
Article DOI: 10.1021/jm3007257
BindingDB Entry DOI: 10.7270/Q2833T5F
Cathepsin B
(Homo sapiens (Human))
BDBM50395254
(CHEMBL2164682)
Show SMILES O=C(NC1(CC1)C#N)[C@@H]1CCCC[C@H]1C(=O)N1CCc2[nH]c3ccccc3c2C1 |r|
Show InChI InChI=1S/C23H26N4O2/c24-14-23(10-11-23)26-21(28)16-6-1-2-7-17(16)22(29)27-12-9-20-18(13-27)15-5-3-4-8-19(15)25-20/h3-5,8,16-17,25H,1-2,6-7,9-13H2,(H,26,28)/t16-,17-/m1/s1
Reactome pathway
n/an/a>2.90E+3n/an/an/an/an/an/a
AstraZeneca
Curated by ChEMBL
Assay Description
Inhibition of human recombinant CatB assessed as suppression of enzyme-mediated Z-Arg-Arg-AMC cleavage by QFRET assay
J Med Chem 55: 6363-74 (2012)
Article DOI: 10.1021/jm3007257
BindingDB Entry DOI: 10.7270/Q2833T5F