BDBM50395331 CHEMBL2164391
SMILES: FC(F)(F)Cc1ccc(CNC(=O)C2N(CCc3ccccn3)C(=O)c3ccccc23)cc1
InChI Key: InChIKey=HPSXNGYRKXICLD-UHFFFAOYSA-N
Data: 3 IC50
Activity Spreadsheet -- Enzyme Inhibition Constant Data from BindingDB
Found 3 hits for monomerid = 50395331
Trg + Lig
Ki
nM
ΔG°
kcal/mole
IC50
nM
Kd
nM
EC50/IC50
nM
koff
s-1
kon
M-1s-1
pHTemp
°C
Sodium channel protein type 5 subunit alpha
(Homo sapiens (Human))
BDBM50395331
(CHEMBL2164391)
Show SMILES FC(F)(F)Cc1ccc(CNC(=O)C2N(CCc3ccccn3)C(=O)c3ccccc23)cc1
Show InChI InChI=1S/C25H22F3N3O2/c26-25(27,28)15-17-8-10-18(11-9-17)16-30-23(32)22-20-6-1-2-7-21(20)24(33)31(22)14-12-19-5-3-4-13-29-19/h1-11,13,22H,12,14-16H2,(H,30,32)
n/an/a 4.40E+3n/an/an/an/an/an/a
AstraZeneca
Curated by ChEMBL
Assay Description
Inhibition of human NaV1.5 alpha subunit expressed in CHOK1 cells at -90 mV holding potential by patch clamp electrophysiological assay
J Med Chem 55: 6866-80 (2012)
Article DOI: 10.1021/jm300623u
BindingDB Entry DOI: 10.7270/Q2M909SB
Sodium channel protein type 9 subunit alpha
(Homo sapiens (Human))
BDBM50395331
(CHEMBL2164391)
Show SMILES FC(F)(F)Cc1ccc(CNC(=O)C2N(CCc3ccccn3)C(=O)c3ccccc23)cc1
Show InChI InChI=1S/C25H22F3N3O2/c26-25(27,28)15-17-8-10-18(11-9-17)16-30-23(32)22-20-6-1-2-7-21(20)24(33)31(22)14-12-19-5-3-4-13-29-19/h1-11,13,22H,12,14-16H2,(H,30,32)
n/an/a 260n/an/an/an/an/an/a
AstraZeneca
Curated by ChEMBL
Assay Description
Inhibition of recombinant human NaV1.7 alpha subunit expressed in HEK293 cells at -65 mV holding potential by patch clamp electrophysiological assay
J Med Chem 55: 6866-80 (2012)
Article DOI: 10.1021/jm300623u
BindingDB Entry DOI: 10.7270/Q2M909SB
Potassium voltage-gated channel subfamily H member 2
(Homo sapiens (Human))
BDBM50395331
(CHEMBL2164391)
Show SMILES FC(F)(F)Cc1ccc(CNC(=O)C2N(CCc3ccccn3)C(=O)c3ccccc23)cc1
Show InChI InChI=1S/C25H22F3N3O2/c26-25(27,28)15-17-8-10-18(11-9-17)16-30-23(32)22-20-6-1-2-7-21(20)24(33)31(22)14-12-19-5-3-4-13-29-19/h1-11,13,22H,12,14-16H2,(H,30,32)
Reactome pathway
n/an/a 1.40E+4n/an/an/an/an/an/a
AstraZeneca
Curated by ChEMBL
Assay Description
Binding affinity to human ERG expressed in CHOK1 cells by IonWorks HT assay
J Med Chem 55: 6866-80 (2012)
Article DOI: 10.1021/jm300623u
BindingDB Entry DOI: 10.7270/Q2M909SB