BDBM50395363 CHEMBL2164375
SMILES: CC(C)(C)OC(=O)N1CC(C1)N1C(C(=O)NCc2ccc(OC(F)(F)F)cc2)c2ccccc2C1=O
InChI Key: InChIKey=VIZAVJRLNLXOKV-UHFFFAOYSA-N
Data: 4 IC50
Activity Spreadsheet -- Enzyme Inhibition Constant Data from BindingDB
Found 4 hits for monomerid = 50395363
Trg + Lig
Ki
nM
ΔG°
kcal/mole
IC50
nM
Kd
nM
EC50/IC50
nM
koff
s-1
kon
M-1s-1
pHTemp
°C
Potassium voltage-gated channel subfamily H member 2
(Homo sapiens (Human))
BDBM50395363
(CHEMBL2164375)
Show SMILES CC(C)(C)OC(=O)N1CC(C1)N1C(C(=O)NCc2ccc(OC(F)(F)F)cc2)c2ccccc2C1=O
Show InChI InChI=1S/C25H26F3N3O5/c1-24(2,3)36-23(34)30-13-16(14-30)31-20(18-6-4-5-7-19(18)22(31)33)21(32)29-12-15-8-10-17(11-9-15)35-25(26,27)28/h4-11,16,20H,12-14H2,1-3H3,(H,29,32)
Reactome pathway
n/an/a 1.10E+4n/an/an/an/an/an/a
AstraZeneca
Curated by ChEMBL
Assay Description
Binding affinity to human ERG expressed in CHOK1 cells by IonWorks HT assay
J Med Chem 55: 6866-80 (2012)
Article DOI: 10.1021/jm300623u
BindingDB Entry DOI: 10.7270/Q2M909SB
Sodium channel protein type 5 subunit alpha
(Homo sapiens (Human))
BDBM50395363
(CHEMBL2164375)
Show SMILES CC(C)(C)OC(=O)N1CC(C1)N1C(C(=O)NCc2ccc(OC(F)(F)F)cc2)c2ccccc2C1=O
Show InChI InChI=1S/C25H26F3N3O5/c1-24(2,3)36-23(34)30-13-16(14-30)31-20(18-6-4-5-7-19(18)22(31)33)21(32)29-12-15-8-10-17(11-9-15)35-25(26,27)28/h4-11,16,20H,12-14H2,1-3H3,(H,29,32)
n/an/a 4.40E+3n/an/an/an/an/an/a
AstraZeneca
Curated by ChEMBL
Assay Description
Inhibition of human NaV1.5 alpha subunit expressed in CHOK1 cells at -90 mV holding potential by patch clamp electrophysiological assay
J Med Chem 55: 6866-80 (2012)
Article DOI: 10.1021/jm300623u
BindingDB Entry DOI: 10.7270/Q2M909SB
Sodium channel protein type 9 subunit alpha
(Homo sapiens (Human))
BDBM50395363
(CHEMBL2164375)
Show SMILES CC(C)(C)OC(=O)N1CC(C1)N1C(C(=O)NCc2ccc(OC(F)(F)F)cc2)c2ccccc2C1=O
Show InChI InChI=1S/C25H26F3N3O5/c1-24(2,3)36-23(34)30-13-16(14-30)31-20(18-6-4-5-7-19(18)22(31)33)21(32)29-12-15-8-10-17(11-9-15)35-25(26,27)28/h4-11,16,20H,12-14H2,1-3H3,(H,29,32)
n/an/a 110n/an/an/an/an/an/a
AstraZeneca
Curated by ChEMBL
Assay Description
Inhibition of recombinant human NaV1.7 alpha subunit expressed in HEK293 cells at -65 mV holding potential by patch clamp electrophysiological assay
J Med Chem 55: 6866-80 (2012)
Article DOI: 10.1021/jm300623u
BindingDB Entry DOI: 10.7270/Q2M909SB
Sodium channel protein type 9 subunit alpha
(Homo sapiens (Human))
BDBM50395363
(CHEMBL2164375)
Show SMILES CC(C)(C)OC(=O)N1CC(C1)N1C(C(=O)NCc2ccc(OC(F)(F)F)cc2)c2ccccc2C1=O
Show InChI InChI=1S/C25H26F3N3O5/c1-24(2,3)36-23(34)30-13-16(14-30)31-20(18-6-4-5-7-19(18)22(31)33)21(32)29-12-15-8-10-17(11-9-15)35-25(26,27)28/h4-11,16,20H,12-14H2,1-3H3,(H,29,32)
n/an/a 2.20E+3n/an/an/an/an/an/a
AstraZeneca
Curated by ChEMBL
Assay Description
Inhibition of recombinant human NaV1.7 alpha subunit expressed in HEK293 cells at -90 mV holding potential by patch clamp electrophysiological assay
J Med Chem 55: 6866-80 (2012)
Article DOI: 10.1021/jm300623u
BindingDB Entry DOI: 10.7270/Q2M909SB