BDBM50395421 CHEMBL2165094
SMILES: Cc1cc(C(N)=O)c(o1)-c1cccc(OC(=O)NCCCCCCc2ccccc2)c1
InChI Key: InChIKey=FCEQLURFAJQTRC-UHFFFAOYSA-N
Data: 1 KI  3 IC50
Activity Spreadsheet -- Enzyme Inhibition Constant Data from BindingDB
Found 4 hits for monomerid = 50395421
Trg + Lig
Ki
nM
ΔG°
kcal/mole
IC50
nM
Kd
nM
EC50/IC50
nM
koff
s-1
kon
M-1s-1
pHTemp
°C
Anandamide amidohydrolase
(Mus musculus (mouse))
BDBM50395421
(CHEMBL2165094)
Show SMILES Cc1cc(C(N)=O)c(o1)-c1cccc(OC(=O)NCCCCCCc2ccccc2)c1
Show InChI InChI=1S/C25H28N2O4/c1-18-16-22(24(26)28)23(30-18)20-13-9-14-21(17-20)31-25(29)27-15-8-3-2-5-10-19-11-6-4-7-12-19/h4,6-7,9,11-14,16-17H,2-3,5,8,10,15H2,1H3,(H2,26,28)(H,27,29)
0.490n/an/an/an/an/an/an/an/a
Universit£ degli Studi di Siena
Curated by ChEMBL
Assay Description
Inhibition of mouse FAAH isolated from brain homogenate using [3H-ethanolamine]AEA as substrate incubated for 20 mins prior to substrate addition mea...
J Med Chem 55: 6898-915 (2012)
Article DOI: 10.1021/jm300689c
BindingDB Entry DOI: 10.7270/Q2ZK5HSK
Anandamide amidohydrolase
(Mus musculus (mouse))
BDBM50395421
(CHEMBL2165094)
Show SMILES Cc1cc(C(N)=O)c(o1)-c1cccc(OC(=O)NCCCCCCc2ccccc2)c1
Show InChI InChI=1S/C25H28N2O4/c1-18-16-22(24(26)28)23(30-18)20-13-9-14-21(17-20)31-25(29)27-15-8-3-2-5-10-19-11-6-4-7-12-19/h4,6-7,9,11-14,16-17H,2-3,5,8,10,15H2,1H3,(H2,26,28)(H,27,29)
n/an/a 1.70n/an/an/an/an/an/a
Universit£ degli Studi di Siena
Curated by ChEMBL
Assay Description
Inhibition of mouse FAAH isolated from brain homogenate using [3H-ethanolamine]AEA as substrate incubated for 20 mins prior to substrate addition mea...
J Med Chem 55: 6898-915 (2012)
Article DOI: 10.1021/jm300689c
BindingDB Entry DOI: 10.7270/Q2ZK5HSK
Potassium voltage-gated channel subfamily H member 2
(Homo sapiens (Human))
BDBM50395421
(CHEMBL2165094)
Show SMILES Cc1cc(C(N)=O)c(o1)-c1cccc(OC(=O)NCCCCCCc2ccccc2)c1
Show InChI InChI=1S/C25H28N2O4/c1-18-16-22(24(26)28)23(30-18)20-13-9-14-21(17-20)31-25(29)27-15-8-3-2-5-10-19-11-6-4-7-12-19/h4,6-7,9,11-14,16-17H,2-3,5,8,10,15H2,1H3,(H2,26,28)(H,27,29)
Reactome pathway
n/an/a>1.00E+4n/an/an/an/an/an/a
Universit£ degli Studi di Siena
Curated by ChEMBL
Assay Description
Inhibition of human ERG expressed in CHOK1 cells for 5 mins by automated patch clamp assay
J Med Chem 55: 6898-915 (2012)
Article DOI: 10.1021/jm300689c
BindingDB Entry DOI: 10.7270/Q2ZK5HSK
Fatty-acid amide hydrolase 1
(Homo sapiens (Human))
BDBM50395421
(CHEMBL2165094)
Show SMILES Cc1cc(C(N)=O)c(o1)-c1cccc(OC(=O)NCCCCCCc2ccccc2)c1
Show InChI InChI=1S/C25H28N2O4/c1-18-16-22(24(26)28)23(30-18)20-13-9-14-21(17-20)31-25(29)27-15-8-3-2-5-10-19-11-6-4-7-12-19/h4,6-7,9,11-14,16-17H,2-3,5,8,10,15H2,1H3,(H2,26,28)(H,27,29)
n/an/a 102n/an/an/an/an/an/a
Universit£ degli Studi di Siena
Curated by ChEMBL
Assay Description
Inhibition of human recombinant FAAH
J Med Chem 55: 6898-915 (2012)
Article DOI: 10.1021/jm300689c
BindingDB Entry DOI: 10.7270/Q2ZK5HSK