BDBM50395470 CHEMBL2163672
SMILES: Clc1cccc(CC(=O)Nc2ccccc2N2CCCCCC2)c1
InChI Key: InChIKey=JEOPXNLVIXKPEN-UHFFFAOYSA-N
Data: 1 EC50
Activity Spreadsheet -- Enzyme Inhibition Constant Data from BindingDB
Found 1 hit for monomerid = 50395470
Trg + Lig
Ki
nM
ΔG°
kcal/mole
IC50
nM
Kd
nM
EC50/IC50
nM
koff
s-1
kon
M-1s-1
pHTemp
°C
KCNQ (Kv7) potassium channel
(Homo sapiens (Human))
BDBM50395470
(CHEMBL2163672)
Show SMILES Clc1cccc(CC(=O)Nc2ccccc2N2CCCCCC2)c1
Show InChI InChI=1S/C20H23ClN2O/c21-17-9-7-8-16(14-17)15-20(24)22-18-10-3-4-11-19(18)23-12-5-1-2-6-13-23/h3-4,7-11,14H,1-2,5-6,12-13,15H2,(H,22,24)
Reactome pathway
n/an/an/an/a>3.00E+4n/an/an/an/a
Vanderbilt University Medical Center
Curated by ChEMBL
Assay Description
Agonist activity at KCNQ2 expressed in CHO cells incubated for 3 mins by automated patch clamp assay
J Med Chem 55: 6975-9 (2012)
Article DOI: 10.1021/jm300700v
BindingDB Entry DOI: 10.7270/Q2KD2017