BDBM50395497 CHEMBL2163664
SMILES: CCC(C(=O)Nc1ccccc1N1CCCC1)c1ccccc1F
InChI Key: InChIKey=PLFHJPATEXMWGD-UHFFFAOYSA-N
Data: 1 IC50
Activity Spreadsheet -- Enzyme Inhibition Constant Data from BindingDB
Found 1 hit for monomerid = 50395497
Trg + Lig
Ki
nM
ΔG°
kcal/mole
IC50
nM
Kd
nM
EC50/IC50
nM
koff
s-1
kon
M-1s-1
pHTemp
°C
KCNQ (Kv7) potassium channel
(Homo sapiens (Human))
BDBM50395497
(CHEMBL2163664)
Show SMILES CCC(C(=O)Nc1ccccc1N1CCCC1)c1ccccc1F
Show InChI InChI=1S/C20H23FN2O/c1-2-15(16-9-3-4-10-17(16)21)20(24)22-18-11-5-6-12-19(18)23-13-7-8-14-23/h3-6,9-12,15H,2,7-8,13-14H2,1H3,(H,22,24)
Reactome pathway
n/an/a 440n/an/an/an/an/an/a
Vanderbilt University Medical Center
Curated by ChEMBL
Assay Description
Antagonist activity at KCNQ2 expressed in CHO cells incubated for 3 mins by automated patch clamp assay
J Med Chem 55: 6975-9 (2012)
Article DOI: 10.1021/jm300700v
BindingDB Entry DOI: 10.7270/Q2KD2017