BDBM50395500 CHEMBL2163659
SMILES: CCC(C(=O)Nc1ccccc1N1CCCC1)c1cccc(Cl)c1
InChI Key: InChIKey=MQJFGYCFWQIDTC-UHFFFAOYSA-N
Data: 1 IC50
Activity Spreadsheet -- Enzyme Inhibition Constant Data from BindingDB
Found 1 hit for monomerid = 50395500
Trg + Lig
Ki
nM
ΔG°
kcal/mole
IC50
nM
Kd
nM
EC50/IC50
nM
koff
s-1
kon
M-1s-1
pHTemp
°C
KCNQ (Kv7) potassium channel
(Homo sapiens (Human))
BDBM50395500
(CHEMBL2163659)
Show SMILES CCC(C(=O)Nc1ccccc1N1CCCC1)c1cccc(Cl)c1
Show InChI InChI=1S/C20H23ClN2O/c1-2-17(15-8-7-9-16(21)14-15)20(24)22-18-10-3-4-11-19(18)23-12-5-6-13-23/h3-4,7-11,14,17H,2,5-6,12-13H2,1H3,(H,22,24)
Reactome pathway
n/an/a 240n/an/an/an/an/an/a
Vanderbilt University Medical Center
Curated by ChEMBL
Assay Description
Antagonist activity at KCNQ2 expressed in CHO cells incubated for 3 mins by automated patch clamp assay
J Med Chem 55: 6975-9 (2012)
Article DOI: 10.1021/jm300700v
BindingDB Entry DOI: 10.7270/Q2KD2017