null
SMILES: Clc1cccc(N2CCCN(CCCOc3ccc4CCNC(=O)c4c3)CC2)c1Cl
InChI Key: InChIKey=IHIMEHQDIJSRNN-UHFFFAOYSA-N
Activity Spreadsheet -- Enzyme Inhibition Constant Data from BindingDB
Found 5 hits for monomerid = 50395570
Trg + Lig
Ki
nM
ΔG°
kcal/mole
IC50
nM
Kd
nM
EC50/IC50
nM
koff
s-1
kon
M-1s-1
pHTemp
°C
D(2) dopamine receptor
(Homo sapiens (Human))
BDBM50395570
(CHEMBL2165118 | UNC10099983 | US9156822, 5)
Show SMILES Clc1cccc(N2CCCN(CCCOc3ccc4CCNC(=O)c4c3)CC2)c1Cl
Show InChI InChI=1S/C23H27Cl2N3O2/c24-20-4-1-5-21(22(20)25)28-12-2-10-27(13-14-28)11-3-15-30-18-7-6-17-8-9-26-23(29)19(17)16-18/h1,4-7,16H,2-3,8-15H2,(H,26,29)
Reactome pathway
5.70n/an/an/an/an/an/an/an/a
University of North Carolina at Chapel Hill
Curated by ChEMBL
Assay Description
Displacement of [3H]N-methylspiperone from human D2L receptor expressed in CHO cells after 1.5 hrs by microbeta counting method
J Med Chem 55: 7141-53 (2012)
Article DOI: 10.1021/jm300603y
BindingDB Entry DOI: 10.7270/Q2JD4XXH
D(2) dopamine receptor
(Homo sapiens (Human))
BDBM50395570
(CHEMBL2165118 | UNC10099983 | US9156822, 5)
Show SMILES Clc1cccc(N2CCCN(CCCOc3ccc4CCNC(=O)c4c3)CC2)c1Cl
Show InChI InChI=1S/C23H27Cl2N3O2/c24-20-4-1-5-21(22(20)25)28-12-2-10-27(13-14-28)11-3-15-30-18-7-6-17-8-9-26-23(29)19(17)16-18/h1,4-7,16H,2-3,8-15H2,(H,26,29)
Reactome pathway
US Patent
5.70n/an/an/an/an/an/a7.4n/a
The University of North Carolina at Chapel Hill
US Patent
Assay Description
Membranes prepared as above were resuspended to 1 ug protein/ul (measured by Bradford assay using BSA as standard), and 50 ul were added to each well...
US Patent US9156822 (2015)
BindingDB Entry DOI: 10.7270/Q2H41Q6D
D(2) dopamine receptor
(Homo sapiens (Human))
BDBM50395570
(CHEMBL2165118 | UNC10099983 | US9156822, 5)
Show SMILES Clc1cccc(N2CCCN(CCCOc3ccc4CCNC(=O)c4c3)CC2)c1Cl
Show InChI InChI=1S/C23H27Cl2N3O2/c24-20-4-1-5-21(22(20)25)28-12-2-10-27(13-14-28)11-3-15-30-18-7-6-17-8-9-26-23(29)19(17)16-18/h1,4-7,16H,2-3,8-15H2,(H,26,29)
Reactome pathway
n/an/an/an/a 6.30n/an/an/an/a
University of North Carolina at Chapel Hill
Curated by ChEMBL
Assay Description
Agonist activity at D2L receptor in human HTLA cells assessed as beta arrestin recruitment at 6 uM after 18 hrs by luminescence assay
J Med Chem 55: 7141-53 (2012)
Article DOI: 10.1021/jm300603y
BindingDB Entry DOI: 10.7270/Q2JD4XXH
D(2) dopamine receptor
(Homo sapiens (Human))
BDBM50395570
(CHEMBL2165118 | UNC10099983 | US9156822, 5)
Show SMILES Clc1cccc(N2CCCN(CCCOc3ccc4CCNC(=O)c4c3)CC2)c1Cl
Show InChI InChI=1S/C23H27Cl2N3O2/c24-20-4-1-5-21(22(20)25)28-12-2-10-27(13-14-28)11-3-15-30-18-7-6-17-8-9-26-23(29)19(17)16-18/h1,4-7,16H,2-3,8-15H2,(H,26,29)
Reactome pathway
US Patent
n/an/an/an/a 5.60n/an/a7.4n/a
The University of North Carolina at Chapel Hill
US Patent
Assay Description
HEK293T cells co-expressing the cAMP biosensor GloSensor-22F (Promega) and hD2 receptors were seeded (10,000 cells/20 ul/well) into white, clear-bott...
US Patent US9156822 (2015)
BindingDB Entry DOI: 10.7270/Q2H41Q6D
D(2) dopamine receptor
(Homo sapiens (Human))
BDBM50395570
(CHEMBL2165118 | UNC10099983 | US9156822, 5)
Show SMILES Clc1cccc(N2CCCN(CCCOc3ccc4CCNC(=O)c4c3)CC2)c1Cl
Show InChI InChI=1S/C23H27Cl2N3O2/c24-20-4-1-5-21(22(20)25)28-12-2-10-27(13-14-28)11-3-15-30-18-7-6-17-8-9-26-23(29)19(17)16-18/h1,4-7,16H,2-3,8-15H2,(H,26,29)
Reactome pathway
US Patent
n/an/an/an/a 8n/an/a7.4n/a
The University of North Carolina at Chapel Hill
US Patent
Assay Description
Recruitment of β-arrestin to agonist-stimulated D2 receptors was performed using a previously described Tango-type assay (Barnea et al., Proc. N...
US Patent US9156822 (2015)
BindingDB Entry DOI: 10.7270/Q2H41Q6D