BDBM50395577 CHEMBL2165138::UNC10099994::US9156822, 22
SMILES: Clc1cccc(C2CCN(CCCOc3ccc4scnc4c3)CC2)c1Cl
InChI Key: InChIKey=URYZTMIOHYGTNJ-UHFFFAOYSA-N
Data: 2 KI  3 EC50
Activity Spreadsheet -- Enzyme Inhibition Constant Data from BindingDB
Found 5 hits for monomerid = 50395577
Trg + Lig
Ki
nM
ΔG°
kcal/mole
IC50
nM
Kd
nM
EC50/IC50
nM
koff
s-1
kon
M-1s-1
pHTemp
°C
D(2) dopamine receptor
(Homo sapiens (Human))
BDBM50395577
(CHEMBL2165138 | UNC10099994 | US9156822, 22)
Show SMILES Clc1cccc(C2CCN(CCCOc3ccc4scnc4c3)CC2)c1Cl
Show InChI InChI=1S/C21H22Cl2N2OS/c22-18-4-1-3-17(21(18)23)15-7-10-25(11-8-15)9-2-12-26-16-5-6-20-19(13-16)24-14-27-20/h1,3-6,13-15H,2,7-12H2
Reactome pathway
75n/an/an/an/an/an/an/an/a
University of North Carolina at Chapel Hill
Curated by ChEMBL
Assay Description
Displacement of [3H]N-methylspiperone from human D2L receptor expressed in CHO cells after 1.5 hrs by microbeta counting method
J Med Chem 55: 7141-53 (2012)
Article DOI: 10.1021/jm300603y
BindingDB Entry DOI: 10.7270/Q2JD4XXH
D(2) dopamine receptor
(Homo sapiens (Human))
BDBM50395577
(CHEMBL2165138 | UNC10099994 | US9156822, 22)
Show SMILES Clc1cccc(C2CCN(CCCOc3ccc4scnc4c3)CC2)c1Cl
Show InChI InChI=1S/C21H22Cl2N2OS/c22-18-4-1-3-17(21(18)23)15-7-10-25(11-8-15)9-2-12-26-16-5-6-20-19(13-16)24-14-27-20/h1,3-6,13-15H,2,7-12H2
Reactome pathway
US Patent
75n/an/an/an/an/an/a7.4n/a
The University of North Carolina at Chapel Hill
US Patent
Assay Description
Membranes prepared as above were resuspended to 1 ug protein/ul (measured by Bradford assay using BSA as standard), and 50 ul were added to each well...
US Patent US9156822 (2015)
BindingDB Entry DOI: 10.7270/Q2H41Q6D
D(2) dopamine receptor
(Homo sapiens (Human))
BDBM50395577
(CHEMBL2165138 | UNC10099994 | US9156822, 22)
Show SMILES Clc1cccc(C2CCN(CCCOc3ccc4scnc4c3)CC2)c1Cl
Show InChI InChI=1S/C21H22Cl2N2OS/c22-18-4-1-3-17(21(18)23)15-7-10-25(11-8-15)9-2-12-26-16-5-6-20-19(13-16)24-14-27-20/h1,3-6,13-15H,2,7-12H2
Reactome pathway
n/an/an/an/a 50n/an/an/an/a
University of North Carolina at Chapel Hill
Curated by ChEMBL
Assay Description
Agonist activity at D2L receptor in human HTLA cells assessed as beta arrestin recruitment at 6 uM after 18 hrs by luminescence assay
J Med Chem 55: 7141-53 (2012)
Article DOI: 10.1021/jm300603y
BindingDB Entry DOI: 10.7270/Q2JD4XXH
D(2) dopamine receptor
(Homo sapiens (Human))
BDBM50395577
(CHEMBL2165138 | UNC10099994 | US9156822, 22)
Show SMILES Clc1cccc(C2CCN(CCCOc3ccc4scnc4c3)CC2)c1Cl
Show InChI InChI=1S/C21H22Cl2N2OS/c22-18-4-1-3-17(21(18)23)15-7-10-25(11-8-15)9-2-12-26-16-5-6-20-19(13-16)24-14-27-20/h1,3-6,13-15H,2,7-12H2
Reactome pathway
US Patent
n/an/an/an/a 100n/an/a7.4n/a
The University of North Carolina at Chapel Hill
US Patent
Assay Description
Recruitment of β-arrestin to agonist-stimulated D2 receptors was performed using a previously described Tango-type assay (Barnea et al., Proc. N...
US Patent US9156822 (2015)
BindingDB Entry DOI: 10.7270/Q2H41Q6D
D(2) dopamine receptor
(Homo sapiens (Human))
BDBM50395577
(CHEMBL2165138 | UNC10099994 | US9156822, 22)
Show SMILES Clc1cccc(C2CCN(CCCOc3ccc4scnc4c3)CC2)c1Cl
Show InChI InChI=1S/C21H22Cl2N2OS/c22-18-4-1-3-17(21(18)23)15-7-10-25(11-8-15)9-2-12-26-16-5-6-20-19(13-16)24-14-27-20/h1,3-6,13-15H,2,7-12H2
Reactome pathway
US Patent
n/an/an/an/a 50n/an/an/an/a
The University of North Carolina at Chapel Hill
US Patent
Assay Description
Cell Culture: Chinese Hamster Ovary (CHO) cells stably expressing the hD2L dopamine receptor (Urban et al., Neuropsychopharmacology 32:67 (2007)) wer...
US Patent US9156822 (2015)
BindingDB Entry DOI: 10.7270/Q2H41Q6D