BDBM50395585 CHEMBL2165129::UNC10000009::US9156822, 27
SMILES: Clc1cccc(N2CCN(CC#CCOc3ccc4CCC(=O)Nc4c3)CC2)c1Cl
InChI Key: InChIKey=FNZOOYYZKQCPEG-UHFFFAOYSA-N
Data: 2 KI  3 EC50
Activity Spreadsheet -- Enzyme Inhibition Constant Data from BindingDB
Found 5 hits for monomerid = 50395585
Trg + Lig
Ki
nM
ΔG°
kcal/mole
IC50
nM
Kd
nM
EC50/IC50
nM
koff
s-1
kon
M-1s-1
pHTemp
°C
D(2) dopamine receptor
(Homo sapiens (Human))
BDBM50395585
(CHEMBL2165129 | UNC10000009 | US9156822, 27)
Show SMILES Clc1cccc(N2CCN(CC#CCOc3ccc4CCC(=O)Nc4c3)CC2)c1Cl
Show InChI InChI=1S/C23H23Cl2N3O2/c24-19-4-3-5-21(23(19)25)28-13-11-27(12-14-28)10-1-2-15-30-18-8-6-17-7-9-22(29)26-20(17)16-18/h3-6,8,16H,7,9-15H2,(H,26,29)
Reactome pathway
US Patent
1.00E+3n/an/an/an/an/an/a7.4n/a
The University of North Carolina at Chapel Hill
US Patent
Assay Description
Membranes prepared as above were resuspended to 1 ug protein/ul (measured by Bradford assay using BSA as standard), and 50 ul were added to each well...
US Patent US9156822 (2015)
BindingDB Entry DOI: 10.7270/Q2H41Q6D
D(2) dopamine receptor
(Homo sapiens (Human))
BDBM50395585
(CHEMBL2165129 | UNC10000009 | US9156822, 27)
Show SMILES Clc1cccc(N2CCN(CC#CCOc3ccc4CCC(=O)Nc4c3)CC2)c1Cl
Show InChI InChI=1S/C23H23Cl2N3O2/c24-19-4-3-5-21(23(19)25)28-13-11-27(12-14-28)10-1-2-15-30-18-8-6-17-7-9-22(29)26-20(17)16-18/h3-6,8,16H,7,9-15H2,(H,26,29)
Reactome pathway
1.00E+3n/an/an/an/an/an/an/an/a
University of North Carolina at Chapel Hill
Curated by ChEMBL
Assay Description
Displacement of [3H]N-methylspiperone from human D2L receptor expressed in CHO cells after 1.5 hrs by microbeta counting method
J Med Chem 55: 7141-53 (2012)
Article DOI: 10.1021/jm300603y
BindingDB Entry DOI: 10.7270/Q2JD4XXH
D(2) dopamine receptor
(Homo sapiens (Human))
BDBM50395585
(CHEMBL2165129 | UNC10000009 | US9156822, 27)
Show SMILES Clc1cccc(N2CCN(CC#CCOc3ccc4CCC(=O)Nc4c3)CC2)c1Cl
Show InChI InChI=1S/C23H23Cl2N3O2/c24-19-4-3-5-21(23(19)25)28-13-11-27(12-14-28)10-1-2-15-30-18-8-6-17-7-9-22(29)26-20(17)16-18/h3-6,8,16H,7,9-15H2,(H,26,29)
Reactome pathway
n/an/an/an/a 199n/an/an/an/a
University of North Carolina at Chapel Hill
Curated by ChEMBL
Assay Description
Partial agonist activity at D2L receptor in human HTLA cells assessed as beta arrestin recruitment at 6 uM after 18 hrs by luminescence assay
J Med Chem 55: 7141-53 (2012)
Article DOI: 10.1021/jm300603y
BindingDB Entry DOI: 10.7270/Q2JD4XXH
D(2) dopamine receptor
(Homo sapiens (Human))
BDBM50395585
(CHEMBL2165129 | UNC10000009 | US9156822, 27)
Show SMILES Clc1cccc(N2CCN(CC#CCOc3ccc4CCC(=O)Nc4c3)CC2)c1Cl
Show InChI InChI=1S/C23H23Cl2N3O2/c24-19-4-3-5-21(23(19)25)28-13-11-27(12-14-28)10-1-2-15-30-18-8-6-17-7-9-22(29)26-20(17)16-18/h3-6,8,16H,7,9-15H2,(H,26,29)
Reactome pathway
US Patent
n/an/an/an/a 1.00E+3n/an/a7.4n/a
The University of North Carolina at Chapel Hill
US Patent
Assay Description
HEK293T cells co-expressing the cAMP biosensor GloSensor-22F (Promega) and hD2 receptors were seeded (10,000 cells/20 ul/well) into white, clear-bott...
US Patent US9156822 (2015)
BindingDB Entry DOI: 10.7270/Q2H41Q6D
D(2) dopamine receptor
(Homo sapiens (Human))
BDBM50395585
(CHEMBL2165129 | UNC10000009 | US9156822, 27)
Show SMILES Clc1cccc(N2CCN(CC#CCOc3ccc4CCC(=O)Nc4c3)CC2)c1Cl
Show InChI InChI=1S/C23H23Cl2N3O2/c24-19-4-3-5-21(23(19)25)28-13-11-27(12-14-28)10-1-2-15-30-18-8-6-17-7-9-22(29)26-20(17)16-18/h3-6,8,16H,7,9-15H2,(H,26,29)
Reactome pathway
US Patent
n/an/an/an/a 610n/an/a7.4n/a
The University of North Carolina at Chapel Hill
US Patent
Assay Description
Recruitment of β-arrestin to agonist-stimulated D2 receptors was performed using a previously described Tango-type assay (Barnea et al., Proc. N...
US Patent US9156822 (2015)
BindingDB Entry DOI: 10.7270/Q2H41Q6D