BDBM50395623 CHEMBL2163688
SMILES: CN(Cc1ccccc1)S(=O)(=O)Nc1ncnc(OCCOc2ncc(Br)cn2)c1-c1ccc(Br)cc1
InChI Key: InChIKey=KUJMAODMTWXUGC-UHFFFAOYSA-N
Data: 2 IC50
Activity Spreadsheet -- Enzyme Inhibition Constant Data from BindingDB
Found 2 hits for monomerid = 50395623
Trg + Lig
Ki
nM
ΔG°
kcal/mole
IC50
nM
Kd
nM
EC50/IC50
nM
koff
s-1
kon
M-1s-1
pHTemp
°C
EDNRB
(Homo sapiens (Human))
BDBM50395623
(CHEMBL2163688)
Show SMILES CN(Cc1ccccc1)S(=O)(=O)Nc1ncnc(OCCOc2ncc(Br)cn2)c1-c1ccc(Br)cc1
Show InChI InChI=1S/C24H22Br2N6O4S/c1-32(15-17-5-3-2-4-6-17)37(33,34)31-22-21(18-7-9-19(25)10-8-18)23(30-16-29-22)35-11-12-36-24-27-13-20(26)14-28-24/h2-10,13-14,16H,11-12,15H2,1H3,(H,29,30,31)
n/an/a 5.21E+3n/an/an/an/an/an/a
Actelion Pharmaceuticals Ltd.
Curated by ChEMBL
Assay Description
Displacement of [I125]ET1 from recombinant ETB receptor expressed in CHO cells after 2 hrs by TopCount analysis
J Med Chem 55: 7849-61 (2012)
Article DOI: 10.1021/jm3009103
BindingDB Entry DOI: 10.7270/Q21C1XZT
Endothelin-1 receptor
(Homo sapiens (Human))
BDBM50395623
(CHEMBL2163688)
Show SMILES CN(Cc1ccccc1)S(=O)(=O)Nc1ncnc(OCCOc2ncc(Br)cn2)c1-c1ccc(Br)cc1
Show InChI InChI=1S/C24H22Br2N6O4S/c1-32(15-17-5-3-2-4-6-17)37(33,34)31-22-21(18-7-9-19(25)10-8-18)23(30-16-29-22)35-11-12-36-24-27-13-20(26)14-28-24/h2-10,13-14,16H,11-12,15H2,1H3,(H,29,30,31)
n/an/a 4.30n/an/an/an/an/an/a
Actelion Pharmaceuticals Ltd.
Curated by ChEMBL
Assay Description
Displacement of [I125]ET1 from recombinant ETA receptor expressed in CHO cells after 2 hrs by TopCount analysis
J Med Chem 55: 7849-61 (2012)
Article DOI: 10.1021/jm3009103
BindingDB Entry DOI: 10.7270/Q21C1XZT