BDBM50395628 CHEMBL2165337
SMILES: CNS(=O)(=O)Nc1ncnc(OCCOc2ncc(Br)cn2)c1-c1ccc(Br)cc1
InChI Key: InChIKey=BRSITRUZDCGGKH-UHFFFAOYSA-N
Data: 2 IC50
Activity Spreadsheet -- Enzyme Inhibition Constant Data from BindingDB
Found 2 hits for monomerid = 50395628
Trg + Lig
Ki
nM
ΔG°
kcal/mole
IC50
nM
Kd
nM
EC50/IC50
nM
koff
s-1
kon
M-1s-1
pHTemp
°C
EDNRB
(Homo sapiens (Human))
BDBM50395628
(CHEMBL2165337)
Show SMILES CNS(=O)(=O)Nc1ncnc(OCCOc2ncc(Br)cn2)c1-c1ccc(Br)cc1
Show InChI InChI=1S/C17H16Br2N6O4S/c1-20-30(26,27)25-15-14(11-2-4-12(18)5-3-11)16(24-10-23-15)28-6-7-29-17-21-8-13(19)9-22-17/h2-5,8-10,20H,6-7H2,1H3,(H,23,24,25)
n/an/a 812n/an/an/an/an/an/a
Actelion Pharmaceuticals Ltd.
Curated by ChEMBL
Assay Description
Displacement of [I125]ET1 from recombinant ETB receptor expressed in CHO cells after 2 hrs by TopCount analysis
J Med Chem 55: 7849-61 (2012)
Article DOI: 10.1021/jm3009103
BindingDB Entry DOI: 10.7270/Q21C1XZT
Endothelin-1 receptor
(Homo sapiens (Human))
BDBM50395628
(CHEMBL2165337)
Show SMILES CNS(=O)(=O)Nc1ncnc(OCCOc2ncc(Br)cn2)c1-c1ccc(Br)cc1
Show InChI InChI=1S/C17H16Br2N6O4S/c1-20-30(26,27)25-15-14(11-2-4-12(18)5-3-11)16(24-10-23-15)28-6-7-29-17-21-8-13(19)9-22-17/h2-5,8-10,20H,6-7H2,1H3,(H,23,24,25)
n/an/a 1.70n/an/an/an/an/an/a
Actelion Pharmaceuticals Ltd.
Curated by ChEMBL
Assay Description
Displacement of [I125]ET1 from recombinant ETA receptor expressed in CHO cells after 2 hrs by TopCount analysis
J Med Chem 55: 7849-61 (2012)
Article DOI: 10.1021/jm3009103
BindingDB Entry DOI: 10.7270/Q21C1XZT