BDBM50395686 CHEMBL2164081
SMILES: CCCCNc1nc(NCc2csc(n2)-c2cccs2)nc(n1)N1CCC[C@@H]1CNS(=O)(=O)c1ccc(cc1)S(C)(=O)=O
InChI Key: InChIKey=GJBZHFOJZXBJSP-HXUWFJFHSA-N
Data: 1 IC50
Activity Spreadsheet -- Enzyme Inhibition Constant Data from BindingDB
Found 1 hit for monomerid = 50395686
Trg + Lig
Ki
nM
ΔG°
kcal/mole
IC50
nM
Kd
nM
EC50/IC50
nM
koff
s-1
kon
M-1s-1
pHTemp
°C
A disintegrin and metalloproteinase with thrombospondin motifs 5 (ADAMTS-5)
(Homo sapiens (Human))
BDBM50395686
(CHEMBL2164081)
Show SMILES CCCCNc1nc(NCc2csc(n2)-c2cccs2)nc(n1)N1CCC[C@@H]1CNS(=O)(=O)c1ccc(cc1)S(C)(=O)=O |r|
Show InChI InChI=1S/C27H34N8O4S4/c1-3-4-13-28-25-32-26(29-16-19-18-41-24(31-19)23-8-6-15-40-23)34-27(33-25)35-14-5-7-20(35)17-30-43(38,39)22-11-9-21(10-12-22)42(2,36)37/h6,8-12,15,18,20,30H,3-5,7,13-14,16-17H2,1-2H3,(H2,28,29,32,33,34)/t20-/m1/s1
Reactome pathway
n/an/a 5.30E+3n/an/an/an/an/an/a
GlaxoSmithKline
Curated by ChEMBL
Assay Description
Inhibition of human ADAMTS-5 expressed in CHO cells using WAAG-3R as substrate preincubated for 15 mins measured after 1 hr by FRET assay
J Med Chem 55: 7061-79 (2012)
Article DOI: 10.1021/jm300449x
BindingDB Entry DOI: 10.7270/Q2RX9D6T