BDBM50395712 CHEMBL2164117
SMILES: FC(F)(F)c1ccc(cc1)S(=O)(=O)NC[C@H]1CCCN1c1nc(NCCC=C)nc(NCc2csc(n2)-c2ccccc2)n1
InChI Key: InChIKey=QLNGYBUVQAEFAW-HSZRJFAPSA-N
Data: 1 IC50
Activity Spreadsheet -- Enzyme Inhibition Constant Data from BindingDB
Found 1 hit for monomerid = 50395712
Trg + Lig
Ki
nM
ΔG°
kcal/mole
IC50
nM
Kd
nM
EC50/IC50
nM
koff
s-1
kon
M-1s-1
pHTemp
°C
A disintegrin and metalloproteinase with thrombospondin motifs 5 (ADAMTS-5)
(Homo sapiens (Human))
BDBM50395712
(CHEMBL2164117)
Show SMILES FC(F)(F)c1ccc(cc1)S(=O)(=O)NC[C@H]1CCCN1c1nc(NCCC=C)nc(NCc2csc(n2)-c2ccccc2)n1 |r|
Show InChI InChI=1S/C29H31F3N8O2S2/c1-2-3-15-33-26-37-27(34-17-22-19-43-25(36-22)20-8-5-4-6-9-20)39-28(38-26)40-16-7-10-23(40)18-35-44(41,42)24-13-11-21(12-14-24)29(30,31)32/h2,4-6,8-9,11-14,19,23,35H,1,3,7,10,15-18H2,(H2,33,34,37,38,39)/t23-/m1/s1
Reactome pathway
n/an/a 60n/an/an/an/an/an/a
GlaxoSmithKline
Curated by ChEMBL
Assay Description
Inhibition of human ADAMTS-5 expressed in CHO cells using WAAG-3R as substrate preincubated for 15 mins measured after 1 hr by FRET assay
J Med Chem 55: 7061-79 (2012)
Article DOI: 10.1021/jm300449x
BindingDB Entry DOI: 10.7270/Q2RX9D6T