BDBM50395718 CHEMBL2164109
SMILES: CCCc1ccc(cc1)S(=O)(=O)NC[C@H]1CCCN1c1nc(NCC(C)C)nc(NCc2csc(n2)-c2ccccc2)n1
InChI Key: InChIKey=IVGBIFJBPJZBSB-AREMUKBSSA-N
Data: 1 IC50
Activity Spreadsheet -- Enzyme Inhibition Constant Data from BindingDB
Found 1 hit for monomerid = 50395718
Trg + Lig
Ki
nM
ΔG°
kcal/mole
IC50
nM
Kd
nM
EC50/IC50
nM
koff
s-1
kon
M-1s-1
pHTemp
°C
A disintegrin and metalloproteinase with thrombospondin motifs 5 (ADAMTS-5)
(Homo sapiens (Human))
BDBM50395718
(CHEMBL2164109)
Show SMILES CCCc1ccc(cc1)S(=O)(=O)NC[C@H]1CCCN1c1nc(NCC(C)C)nc(NCc2csc(n2)-c2ccccc2)n1 |r|
Show InChI InChI=1S/C31H40N8O2S2/c1-4-9-23-13-15-27(16-14-23)43(40,41)34-20-26-12-8-17-39(26)31-37-29(32-18-22(2)3)36-30(38-31)33-19-25-21-42-28(35-25)24-10-6-5-7-11-24/h5-7,10-11,13-16,21-22,26,34H,4,8-9,12,17-20H2,1-3H3,(H2,32,33,36,37,38)/t26-/m1/s1
Reactome pathway
n/an/a 120n/an/an/an/an/an/a
GlaxoSmithKline
Curated by ChEMBL
Assay Description
Inhibition of human ADAMTS-5 expressed in CHO cells using WAAG-3R as substrate preincubated for 15 mins measured after 1 hr by FRET assay
J Med Chem 55: 7061-79 (2012)
Article DOI: 10.1021/jm300449x
BindingDB Entry DOI: 10.7270/Q2RX9D6T