null
SMILES: OCCCCN(Cc1cccc2ccccc12)c1cc(nc(=O)[nH]1)N1CCOCC1
InChI Key: InChIKey=MKRMWKWDMTZJOB-UHFFFAOYSA-N
Activity Spreadsheet -- Enzyme Inhibition Constant Data from BindingDB
Found 2 hits for monomerid = 50395811
Trg + Lig
Ki
nM
ΔG°
kcal/mole
IC50
nM
Kd
nM
EC50/IC50
nM
koff
s-1
kon
M-1s-1
pHTemp
°C
Phosphatidylinositol 4,5-bisphosphate 3-kinase catalytic subunit beta isoform
(Homo sapiens (Human))
BDBM50395811
(CHEMBL2165182)
Show SMILES OCCCCN(Cc1cccc2ccccc12)c1cc(nc(=O)[nH]1)N1CCOCC1
Show InChI InChI=1S/C23H28N4O3/c28-13-4-3-10-27(17-19-8-5-7-18-6-1-2-9-20(18)19)22-16-21(24-23(29)25-22)26-11-14-30-15-12-26/h1-2,5-9,16,28H,3-4,10-15,17H2,(H,24,25,29)
NCI pathway
Reactome pathway
n/an/a 200n/an/an/an/an/an/a
AstraZeneca
Curated by ChEMBL
Assay Description
Inhibition of human recombinant His6-tagged PI3K p110beta expressed in baculovirus infected cells using DiC8-PI(4,5)P2 as substrate after 20 mins by ...
Bioorg Med Chem Lett 22: 6671-6 (2012)
Article DOI: 10.1016/j.bmcl.2012.08.102
BindingDB Entry DOI: 10.7270/Q2445NKM
Phosphatidylinositol 4,5-bisphosphate 3-kinase catalytic subunit alpha isoform
(Homo sapiens (Human))
BDBM50395811
(CHEMBL2165182)
Show SMILES OCCCCN(Cc1cccc2ccccc12)c1cc(nc(=O)[nH]1)N1CCOCC1
Show InChI InChI=1S/C23H28N4O3/c28-13-4-3-10-27(17-19-8-5-7-18-6-1-2-9-20(18)19)22-16-21(24-23(29)25-22)26-11-14-30-15-12-26/h1-2,5-9,16,28H,3-4,10-15,17H2,(H,24,25,29)
NCI pathway
Reactome pathway
n/an/a 7.37E+4n/an/an/an/an/an/a
AstraZeneca
Curated by ChEMBL
Assay Description
Inhibition of human recombinant His6-tagged PI3K p110alpha expressed in baculovirus infected cells using DiC8-PI(4,5)P2 as substrate after 20 mins by...
Bioorg Med Chem Lett 22: 6671-6 (2012)
Article DOI: 10.1016/j.bmcl.2012.08.102
BindingDB Entry DOI: 10.7270/Q2445NKM