BDBM50395855 CHEMBL2165524
SMILES: CN(C)C1CCc2c(C1)c1cc(Br)ccc1n2S(=O)(=O)c1ccccc1
InChI Key: InChIKey=BPDIPISJQZBBJL-UHFFFAOYSA-N
Data: 1 KI  1 IC50
Activity Spreadsheet -- Enzyme Inhibition Constant Data from BindingDB
Found 2 hits for monomerid = 50395855
Trg + Lig
Ki
nM
ΔG°
kcal/mole
IC50
nM
Kd
nM
EC50/IC50
nM
koff
s-1
kon
M-1s-1
pHTemp
°C
5-hydroxytryptamine receptor 6
(Homo sapiens (Human))
BDBM50395855
(CHEMBL2165524)
Show SMILES CN(C)C1CCc2c(C1)c1cc(Br)ccc1n2S(=O)(=O)c1ccccc1
Show InChI InChI=1S/C20H21BrN2O2S/c1-22(2)15-9-11-20-18(13-15)17-12-14(21)8-10-19(17)23(20)26(24,25)16-6-4-3-5-7-16/h3-8,10,12,15H,9,11,13H2,1-2H3
Reactome pathway
1.83n/an/an/an/an/an/an/an/a
Suven Life Sciences Ltd
Curated by ChEMBL
Assay Description
Displacement of [3H]LSD from human cloned 5-HT6 receptor expressed in HEK293 cells
Bioorg Med Chem Lett 22: 6980-5 (2012)
Article DOI: 10.1016/j.bmcl.2012.06.002
BindingDB Entry DOI: 10.7270/Q2QZ2C3F
5-hydroxytryptamine receptor 6
(Homo sapiens (Human))
BDBM50395855
(CHEMBL2165524)
Show SMILES CN(C)C1CCc2c(C1)c1cc(Br)ccc1n2S(=O)(=O)c1ccccc1
Show InChI InChI=1S/C20H21BrN2O2S/c1-22(2)15-9-11-20-18(13-15)17-12-14(21)8-10-19(17)23(20)26(24,25)16-6-4-3-5-7-16/h3-8,10,12,15H,9,11,13H2,1-2H3
Reactome pathway
n/an/a 2.06E+3n/an/an/an/an/an/a
Suven Life Sciences Ltd
Curated by ChEMBL
Assay Description
Antagonist activity at human recombinant 5-HT6 receptor expressed in CHO cells assessed as inhibition of 5-HT-stimulated cAMP accumulation after 4 hr...
Bioorg Med Chem Lett 22: 6980-5 (2012)
Article DOI: 10.1016/j.bmcl.2012.06.002
BindingDB Entry DOI: 10.7270/Q2QZ2C3F