BDBM50395901 CHEMBL2164188
SMILES: CC(CCc1cc(on1)-c1cccc(Cl)c1Cl)(C(=O)NO)S(C)(=O)=O
InChI Key: InChIKey=CVXUCGSXHDPRDD-UHFFFAOYSA-N
Data: 1 IC50
Activity Spreadsheet -- Enzyme Inhibition Constant Data from BindingDB
Found 1 hit for monomerid = 50395901
Trg + Lig
Ki
nM
ΔG°
kcal/mole
IC50
nM
Kd
nM
EC50/IC50
nM
koff
s-1
kon
M-1s-1
pHTemp
°C
UDP-3-O-acyl-N-acetylglucosamine deacetylase
(Pseudomonas aeruginosa)
BDBM50395901
(CHEMBL2164188)
Show SMILES CC(CCc1cc(on1)-c1cccc(Cl)c1Cl)(C(=O)NO)S(C)(=O)=O
Show InChI InChI=1S/C15H16Cl2N2O5S/c1-15(14(20)18-21,25(2,22)23)7-6-9-8-12(24-19-9)10-4-3-5-11(16)13(10)17/h3-5,8,21H,6-7H2,1-2H3,(H,18,20)
n/an/a 2.66n/an/an/an/an/an/a
Pfizer Inc.
Curated by ChEMBL
Assay Description
Inhibition of Pseudomonas aeruginosa LpxC
Bioorg Med Chem Lett 22: 6832-8 (2012)
Article DOI: 10.1016/j.bmcl.2012.09.058
BindingDB Entry DOI: 10.7270/Q2GF0VMV