BDBM50395903 CHEMBL2164186
SMILES: C[C@@](CCn1cc(nn1)-c1cccc(F)c1F)(C(=O)NO)S(C)(=O)=O
InChI Key: InChIKey=XCJCGAILNBTULO-CQSZACIVSA-N
Data: 1 IC50
Activity Spreadsheet -- Enzyme Inhibition Constant Data from BindingDB
Found 1 hit for monomerid = 50395903
Trg + Lig
Ki
nM
ΔG°
kcal/mole
IC50
nM
Kd
nM
EC50/IC50
nM
koff
s-1
kon
M-1s-1
pHTemp
°C
UDP-3-O-acyl-N-acetylglucosamine deacetylase
(Pseudomonas aeruginosa)
BDBM50395903
(CHEMBL2164186)
Show SMILES C[C@@](CCn1cc(nn1)-c1cccc(F)c1F)(C(=O)NO)S(C)(=O)=O |r|
Show InChI InChI=1S/C14H16F2N4O4S/c1-14(13(21)18-22,25(2,23)24)6-7-20-8-11(17-19-20)9-4-3-5-10(15)12(9)16/h3-5,8,22H,6-7H2,1-2H3,(H,18,21)/t14-/m1/s1
n/an/a 8.08n/an/an/an/an/an/a
Pfizer Inc.
Curated by ChEMBL
Assay Description
Inhibition of Pseudomonas aeruginosa LpxC
Bioorg Med Chem Lett 22: 6832-8 (2012)
Article DOI: 10.1016/j.bmcl.2012.09.058
BindingDB Entry DOI: 10.7270/Q2GF0VMV