BDBM50395919 CHEMBL2164513
SMILES: C[C@@](CCn1cc(cn1)-c1ccccc1)(C(=O)NO)S(C)(=O)=O
InChI Key: InChIKey=HADRFJLXOJPPBT-OAHLLOKOSA-N
Data: 1 IC50
Activity Spreadsheet -- Enzyme Inhibition Constant Data from BindingDB
Found 1 hit for monomerid = 50395919
Trg + Lig
Ki
nM
ΔG°
kcal/mole
IC50
nM
Kd
nM
EC50/IC50
nM
koff
s-1
kon
M-1s-1
pHTemp
°C
UDP-3-O-acyl-N-acetylglucosamine deacetylase
(Pseudomonas aeruginosa)
BDBM50395919
(CHEMBL2164513)
Show SMILES C[C@@](CCn1cc(cn1)-c1ccccc1)(C(=O)NO)S(C)(=O)=O |r|
Show InChI InChI=1S/C15H19N3O4S/c1-15(14(19)17-20,23(2,21)22)8-9-18-11-13(10-16-18)12-6-4-3-5-7-12/h3-7,10-11,20H,8-9H2,1-2H3,(H,17,19)/t15-/m1/s1
n/an/a 1.61n/an/an/an/an/an/a
Pfizer Inc.
Curated by ChEMBL
Assay Description
Inhibition of Pseudomonas aeruginosa LpxC
Bioorg Med Chem Lett 22: 6832-8 (2012)
Article DOI: 10.1016/j.bmcl.2012.09.058
BindingDB Entry DOI: 10.7270/Q2GF0VMV