BDBM50395942 CHEMBL2164545
SMILES: Fc1cc(cc(c1)-c1nc(co1)-c1ccccn1)C#N
InChI Key: InChIKey=PURMTHHDJDASBS-UHFFFAOYSA-N
Data: 1 IC50
Activity Spreadsheet -- Enzyme Inhibition Constant Data from BindingDB
Found 1 hit for monomerid = 50395942
Trg + Lig
Ki
nM
ΔG°
kcal/mole
IC50
nM
Kd
nM
EC50/IC50
nM
koff
s-1
kon
M-1s-1
pHTemp
°C
Metabotropic glutamate receptor 5
(Homo sapiens (Human))
BDBM50395942
(CHEMBL2164545)
Show SMILES Fc1cc(cc(c1)-c1nc(co1)-c1ccccn1)C#N
Show InChI InChI=1S/C15H8FN3O/c16-12-6-10(8-17)5-11(7-12)15-19-14(9-20-15)13-3-1-2-4-18-13/h1-7,9H
n/an/a 22n/an/an/an/an/an/a
AstraZeneca
Curated by ChEMBL
Assay Description
Negative allosteric modulation of human recombinant mGluR5 expressed in HEK293 cells expressing GLAST assessed as inhibition of DHPG-induced intracel...
Bioorg Med Chem Lett 22: 6974-9 (2012)
Article DOI: 10.1016/j.bmcl.2012.08.100
BindingDB Entry DOI: 10.7270/Q2BP03WH