BDBM50396208 CHEMBL2172033
SMILES: Cc1[nH]nc(C(O)=O)c1Cc1cccc(c1)-c1ccccc1F
InChI Key: InChIKey=NJSJHHCGXSCNIM-UHFFFAOYSA-N
Data: 1 IC50
Activity Spreadsheet -- Enzyme Inhibition Constant Data from BindingDB
Found 1 hit for monomerid = 50396208
Trg + Lig
Ki
nM
ΔG°
kcal/mole
IC50
nM
Kd
nM
EC50/IC50
nM
koff
s-1
kon
M-1s-1
pHTemp
°C
Hydroxyacid oxidase 2
(Rattus norvegicus)
BDBM50396208
(CHEMBL2172033)
Show SMILES Cc1[nH]nc(C(O)=O)c1Cc1cccc(c1)-c1ccccc1F
Show InChI InChI=1S/C18H15FN2O2/c1-11-15(17(18(22)23)21-20-11)10-12-5-4-6-13(9-12)14-7-2-3-8-16(14)19/h2-9H,10H2,1H3,(H,20,21)(H,22,23)
n/an/a 900n/an/an/an/an/an/a
Advinus Therapeutics
Curated by ChEMBL
Assay Description
Inhibition of rat Hao2-mediated oxidation of 2-hydroxyoctanoic acid assessed as proportionate release of H2O2
Bioorg Med Chem Lett 22: 4341-7 (2012)
Article DOI: 10.1016/j.bmcl.2012.05.020
BindingDB Entry DOI: 10.7270/Q20866FZ