BDBM50396219 CHEMBL2172059
SMILES: Cc1[nH]nc(C(O)=O)c1Cc1ccc(F)cc1
InChI Key: InChIKey=SMYLJADTZHRKPL-UHFFFAOYSA-N
Data: 1 IC50
Activity Spreadsheet -- Enzyme Inhibition Constant Data from BindingDB
Found 1 hit for monomerid = 50396219
Trg + Lig
Ki
nM
ΔG°
kcal/mole
IC50
nM
Kd
nM
EC50/IC50
nM
koff
s-1
kon
M-1s-1
pHTemp
°C
Hydroxyacid oxidase 2
(Rattus norvegicus)
BDBM50396219
(CHEMBL2172059)
Show SMILES Cc1[nH]nc(C(O)=O)c1Cc1ccc(F)cc1
Show InChI InChI=1S/C12H11FN2O2/c1-7-10(11(12(16)17)15-14-7)6-8-2-4-9(13)5-3-8/h2-5H,6H2,1H3,(H,14,15)(H,16,17)
n/an/a 700n/an/an/an/an/an/a
Advinus Therapeutics
Curated by ChEMBL
Assay Description
Inhibition of rat Hao2-mediated oxidation of 2-hydroxyoctanoic acid assessed as proportionate release of H2O2
Bioorg Med Chem Lett 22: 4341-7 (2012)
Article DOI: 10.1016/j.bmcl.2012.05.020
BindingDB Entry DOI: 10.7270/Q20866FZ