BDBM50396464 CHEMBL2170603
SMILES: CC(=O)N1CCC(CC1)c1cc(C)c(cc1S(C)(=O)=O)C(=O)NC(N)=N
InChI Key: InChIKey=BHNSDIWJQXPHSQ-UHFFFAOYSA-N
Data: 2 IC50
Activity Spreadsheet -- Enzyme Inhibition Constant Data from BindingDB
Found 2 hits for monomerid = 50396464
Trg + Lig
Ki
nM
ΔG°
kcal/mole
IC50
nM
Kd
nM
EC50/IC50
nM
koff
s-1
kon
M-1s-1
pHTemp
°C
Sodium/hydrogen exchanger 1
(Homo sapiens (Human))
BDBM50396464
(CHEMBL2170603)
Show SMILES CC(=O)N1CCC(CC1)c1cc(C)c(cc1S(C)(=O)=O)C(=O)NC(N)=N
Show InChI InChI=1S/C17H24N4O4S/c1-10-8-14(12-4-6-21(7-5-12)11(2)22)15(26(3,24)25)9-13(10)16(23)20-17(18)19/h8-9,12H,4-7H2,1-3H3,(H4,18,19,20,23)
NCI pathway
Reactome pathway
n/an/a 15n/an/an/an/an/an/a
Boehringer Ingelheim Pharmaceuticals
Curated by ChEMBL
Assay Description
Inhibition of NHE1 in human HT-29 cells assessed as intracellular pH change after 30 mins
J Med Chem 55: 7114-40 (2012)
Article DOI: 10.1021/jm300601d
BindingDB Entry DOI: 10.7270/Q2FB5430
Sodium/hydrogen exchanger 1
(Homo sapiens (Human))
BDBM50396464
(CHEMBL2170603)
Show SMILES CC(=O)N1CCC(CC1)c1cc(C)c(cc1S(C)(=O)=O)C(=O)NC(N)=N
Show InChI InChI=1S/C17H24N4O4S/c1-10-8-14(12-4-6-21(7-5-12)11(2)22)15(26(3,24)25)9-13(10)16(23)20-17(18)19/h8-9,12H,4-7H2,1-3H3,(H4,18,19,20,23)
NCI pathway
Reactome pathway
n/an/a 56n/an/an/an/an/an/a
Boehringer Ingelheim Pharmaceuticals
Curated by ChEMBL
Assay Description
Inhibition of NHE1 in human platelet rich plasma assessed as reduction of propionate medium induced platelet swelling measured every 6 secs for 5 min...
J Med Chem 55: 7114-40 (2012)
Article DOI: 10.1021/jm300601d
BindingDB Entry DOI: 10.7270/Q2FB5430