BDBM50396539 CHEMBL2171144
SMILES: Cc1cccc(CC(=O)N2CCc3cc(ccc23)-c2cn(C)c3ncnc(N)c23)c1
InChI Key: InChIKey=AMQHYFMNSQHFAH-UHFFFAOYSA-N
Data: 1 IC50
Activity Spreadsheet -- Enzyme Inhibition Constant Data from BindingDB
Found 1 hit for monomerid = 50396539
Trg + Lig
Ki
nM
ΔG°
kcal/mole
IC50
nM
Kd
nM
EC50/IC50
nM
koff
s-1
kon
M-1s-1
pHTemp
°C
Eukaryotic translation initiation factor 2-alpha kinase 3
(Homo sapiens (Human))
BDBM50396539
(CHEMBL2171144)
Show SMILES Cc1cccc(CC(=O)N2CCc3cc(ccc23)-c2cn(C)c3ncnc(N)c23)c1
Show InChI InChI=1S/C24H23N5O/c1-15-4-3-5-16(10-15)11-21(30)29-9-8-18-12-17(6-7-20(18)29)19-13-28(2)24-22(19)23(25)26-14-27-24/h3-7,10,12-14H,8-9,11H2,1-2H3,(H2,25,26,27)
n/an/a 0.200n/an/an/an/an/an/a
GlaxoSmithKline Research and Development
Curated by ChEMBL
Assay Description
Inhibition of GST tagged PERK cytoplasmic domain mediated EIF2alpha phosphorylation
J Med Chem 55: 7193-207 (2012)
Article DOI: 10.1021/jm300713s
BindingDB Entry DOI: 10.7270/Q2222VWP