BDBM50396662 CHEMBL2172109
SMILES: CC1N(CCc2ccccc12)S(=O)(=O)c1cccc(c1)C(O)=O
InChI Key: InChIKey=CKYDHLILOOYRDF-UHFFFAOYSA-N
Data: 7 IC50
Activity Spreadsheet -- Enzyme Inhibition Constant Data from BindingDB
Found 7 hits for monomerid = 50396662
Trg + Lig
Ki
nM
ΔG°
kcal/mole
IC50
nM
Kd
nM
EC50/IC50
nM
koff
s-1
kon
M-1s-1
pHTemp
°C
Aldo-keto reductase family 1 member C1
(Homo sapiens (Human))
BDBM50396662
(CHEMBL2172109)
Show SMILES CC1N(CCc2ccccc12)S(=O)(=O)c1cccc(c1)C(O)=O
Show InChI InChI=1S/C17H17NO4S/c1-12-16-8-3-2-5-13(16)9-10-18(12)23(21,22)15-7-4-6-14(11-15)17(19)20/h2-8,11-12H,9-10H2,1H3,(H,19,20)
Reactome pathway
n/an/a>3.00E+4n/an/an/an/an/an/a
University of Auckland
Curated by ChEMBL
Assay Description
Inhibition of human recombinant N-terminal His6-tagged AKR1C1 expressed in Escherichia coli BL21(DE3) cells using 8-Acetyl-2,3,5,6-tetrahydro-1H,4H-1...
J Med Chem 55: 7746-58 (2012)
Article DOI: 10.1021/jm3007867
BindingDB Entry DOI: 10.7270/Q28K7B6F
Aldo-keto reductase family 1 member C4 (AK1C4)
(Homo sapiens (Human))
BDBM50396662
(CHEMBL2172109)
Show SMILES CC1N(CCc2ccccc12)S(=O)(=O)c1cccc(c1)C(O)=O
Show InChI InChI=1S/C17H17NO4S/c1-12-16-8-3-2-5-13(16)9-10-18(12)23(21,22)15-7-4-6-14(11-15)17(19)20/h2-8,11-12H,9-10H2,1H3,(H,19,20)
n/an/a>3.00E+4n/an/an/an/an/an/a
University of Auckland
Curated by ChEMBL
Assay Description
Inhibition of human recombinant N-terminal His6-tagged AKR1C4 expressed in Escherichia coli BL21(DE3) cells using 8-Acetyl-2,3,5,6-tetrahydro-1H,4H-1...
J Med Chem 55: 7746-58 (2012)
Article DOI: 10.1021/jm3007867
BindingDB Entry DOI: 10.7270/Q28K7B6F
Aldo-keto reductase family 1 member C2
(Homo sapiens (Human))
BDBM50396662
(CHEMBL2172109)
Show SMILES CC1N(CCc2ccccc12)S(=O)(=O)c1cccc(c1)C(O)=O
Show InChI InChI=1S/C17H17NO4S/c1-12-16-8-3-2-5-13(16)9-10-18(12)23(21,22)15-7-4-6-14(11-15)17(19)20/h2-8,11-12H,9-10H2,1H3,(H,19,20)
Reactome pathway
n/an/a>3.00E+4n/an/an/an/an/an/a
University of Auckland
Curated by ChEMBL
Assay Description
Inhibition of human recombinant N-terminal His6-tagged AKR1C2 expressed in Escherichia coli BL21(DE3) cells using 8-Acetyl-2,3,5,6-tetrahydro-1H,4H-1...
J Med Chem 55: 7746-58 (2012)
Article DOI: 10.1021/jm3007867
BindingDB Entry DOI: 10.7270/Q28K7B6F
Aldo-keto-reductase family 1 member C3
(Homo sapiens (Human))
BDBM50396662
(CHEMBL2172109)
Show SMILES CC1N(CCc2ccccc12)S(=O)(=O)c1cccc(c1)C(O)=O
Show InChI InChI=1S/C17H17NO4S/c1-12-16-8-3-2-5-13(16)9-10-18(12)23(21,22)15-7-4-6-14(11-15)17(19)20/h2-8,11-12H,9-10H2,1H3,(H,19,20)
n/an/a 27n/an/an/an/an/an/a
Guangzhou Medical University
Curated by ChEMBL
Assay Description
Inhibition of human recombinant His-tagged AKR1C3 expressed in Escherichia coli BL21 (DE3) cells using 8-Acetyl-2,3,5,6-tetrahydro-1H,4H-11-oxa-3a-az...
Bioorg Med Chem Lett 26: 5631-5638 (2016)
Article DOI: 10.1016/j.bmcl.2016.10.073
BindingDB Entry DOI: 10.7270/Q200043M
17-beta-Hydroxysteroid Dehydrogenase 5 (17-beta-HSD5, AKR1C3)
(Homo sapiens (Human))
BDBM50396662
(CHEMBL2172109)
Show SMILES CC1N(CCc2ccccc12)S(=O)(=O)c1cccc(c1)C(O)=O
Show InChI InChI=1S/C17H17NO4S/c1-12-16-8-3-2-5-13(16)9-10-18(12)23(21,22)15-7-4-6-14(11-15)17(19)20/h2-8,11-12H,9-10H2,1H3,(H,19,20)
n/an/a 24n/an/an/an/an/an/a
University of Auckland
Curated by ChEMBL
Assay Description
Inhibition of AKR1C3 overexpressed in human HCT116 cells assessed as inhibition of PR-104A conversion to hydroxylamine after 2 hrs by spectrophotomet...
J Med Chem 55: 7746-58 (2012)
Article DOI: 10.1021/jm3007867
BindingDB Entry DOI: 10.7270/Q28K7B6F
17-beta-Hydroxysteroid Dehydrogenase 5 (17-beta-HSD5, AKR1C3)
(Homo sapiens (Human))
BDBM50396662
(CHEMBL2172109)
Show SMILES CC1N(CCc2ccccc12)S(=O)(=O)c1cccc(c1)C(O)=O
Show InChI InChI=1S/C17H17NO4S/c1-12-16-8-3-2-5-13(16)9-10-18(12)23(21,22)15-7-4-6-14(11-15)17(19)20/h2-8,11-12H,9-10H2,1H3,(H,19,20)
n/an/a 27n/an/an/an/an/an/a
Guangzhou Medical University
Curated by ChEMBL
Assay Description
Inhibition of human recombinant His-tagged AKR1C3 expressed in Escherichia coli BL21 (DE3) cells using 8-Acetyl-2,3,5,6-tetrahydro-1H,4H-11-oxa-3a-az...
Bioorg Med Chem Lett 26: 5631-5638 (2016)
Article DOI: 10.1016/j.bmcl.2016.10.073
BindingDB Entry DOI: 10.7270/Q200043M
17-beta-Hydroxysteroid Dehydrogenase 5 (17-beta-HSD5, AKR1C3)
(Homo sapiens (Human))
BDBM50396662
(CHEMBL2172109)
Show SMILES CC1N(CCc2ccccc12)S(=O)(=O)c1cccc(c1)C(O)=O
Show InChI InChI=1S/C17H17NO4S/c1-12-16-8-3-2-5-13(16)9-10-18(12)23(21,22)15-7-4-6-14(11-15)17(19)20/h2-8,11-12H,9-10H2,1H3,(H,19,20)
n/an/a 27n/an/an/an/an/an/a
University of Auckland
Curated by ChEMBL
Assay Description
Inhibition of human recombinant N-terminal His6-tagged AKR1C3 expressed in Escherichia coli BL21(DE3) cells using 8-Acetyl-2,3,5,6-tetrahydro-1H,4H-1...
J Med Chem 55: 7746-58 (2012)
Article DOI: 10.1021/jm3007867
BindingDB Entry DOI: 10.7270/Q28K7B6F