BDBM50396690 CHEMBL2172078
SMILES: OC(=O)[C@@H]1CCCN(C1)S(=O)(=O)c1ccc2ccccc2c1
InChI Key: InChIKey=KTQWWYGLWQVHDM-CQSZACIVSA-N
Data: 7 IC50
PDB links: 1 PDB ID matches this monomer.
Activity Spreadsheet -- Enzyme Inhibition Constant Data from BindingDB
Found 7 hits for monomerid = 50396690
Trg + Lig
Ki
nM
ΔG°
kcal/mole
IC50
nM
Kd
nM
EC50/IC50
nM
koff
s-1
kon
M-1s-1
pHTemp
°C
17-beta-Hydroxysteroid Dehydrogenase 5 (17-beta-HSD5, AKR1C3)
(Homo sapiens (Human))
BDBM50396690
(CHEMBL2172078)
Show SMILES OC(=O)[C@@H]1CCCN(C1)S(=O)(=O)c1ccc2ccccc2c1 |r|
Show InChI InChI=1S/C16H17NO4S/c18-16(19)14-6-3-9-17(11-14)22(20,21)15-8-7-12-4-1-2-5-13(12)10-15/h1-2,4-5,7-8,10,14H,3,6,9,11H2,(H,18,19)/t14-/m1/s1
n/an/a>1.00E+3n/an/an/an/an/an/a
University of Auckland
Curated by ChEMBL
Assay Description
Inhibition of AKR1C3 overexpressed in human HCT116 cells assessed as inhibition of PR-104A conversion to hydroxylamine after 2 hrs by spectrophotomet...
J Med Chem 55: 7746-58 (2012)
Article DOI: 10.1021/jm3007867
BindingDB Entry DOI: 10.7270/Q28K7B6F
3D
3D Structure (crystal)
Aldo-keto reductase family 1 member C4 (AK1C4)
(Homo sapiens (Human))
BDBM50396690
(CHEMBL2172078)
Show SMILES OC(=O)[C@@H]1CCCN(C1)S(=O)(=O)c1ccc2ccccc2c1 |r|
Show InChI InChI=1S/C16H17NO4S/c18-16(19)14-6-3-9-17(11-14)22(20,21)15-8-7-12-4-1-2-5-13(12)10-15/h1-2,4-5,7-8,10,14H,3,6,9,11H2,(H,18,19)/t14-/m1/s1
n/an/a>3.00E+4n/an/an/an/an/an/a
University of Auckland
Curated by ChEMBL
Assay Description
Inhibition of human recombinant N-terminal His6-tagged AKR1C4 expressed in Escherichia coli BL21(DE3) cells using 8-Acetyl-2,3,5,6-tetrahydro-1H,4H-1...
J Med Chem 55: 7746-58 (2012)
Article DOI: 10.1021/jm3007867
BindingDB Entry DOI: 10.7270/Q28K7B6F
Aldo-keto reductase family 1 member C2
(Homo sapiens (Human))
BDBM50396690
(CHEMBL2172078)
Show SMILES OC(=O)[C@@H]1CCCN(C1)S(=O)(=O)c1ccc2ccccc2c1 |r|
Show InChI InChI=1S/C16H17NO4S/c18-16(19)14-6-3-9-17(11-14)22(20,21)15-8-7-12-4-1-2-5-13(12)10-15/h1-2,4-5,7-8,10,14H,3,6,9,11H2,(H,18,19)/t14-/m1/s1
Reactome pathway
n/an/a>3.00E+4n/an/an/an/an/an/a
University of Auckland
Curated by ChEMBL
Assay Description
Inhibition of human recombinant N-terminal His6-tagged AKR1C2 expressed in Escherichia coli BL21(DE3) cells using 8-Acetyl-2,3,5,6-tetrahydro-1H,4H-1...
J Med Chem 55: 7746-58 (2012)
Article DOI: 10.1021/jm3007867
BindingDB Entry DOI: 10.7270/Q28K7B6F
3D
3D Structure (crystal)
17-beta-Hydroxysteroid Dehydrogenase 5 (17-beta-HSD5, AKR1C3)
(Homo sapiens (Human))
BDBM50396690
(CHEMBL2172078)
Show SMILES OC(=O)[C@@H]1CCCN(C1)S(=O)(=O)c1ccc2ccccc2c1 |r|
Show InChI InChI=1S/C16H17NO4S/c18-16(19)14-6-3-9-17(11-14)22(20,21)15-8-7-12-4-1-2-5-13(12)10-15/h1-2,4-5,7-8,10,14H,3,6,9,11H2,(H,18,19)/t14-/m1/s1
n/an/a 32n/an/an/an/an/an/a
Guangzhou Medical University
Curated by ChEMBL
Assay Description
Inhibition of human recombinant His-tagged AKR1C3 expressed in Escherichia coli BL21 (DE3) cells using 8-Acetyl-2,3,5,6-tetrahydro-1H,4H-11-oxa-3a-az...
Bioorg Med Chem Lett 26: 5631-5638 (2016)
Article DOI: 10.1016/j.bmcl.2016.10.073
BindingDB Entry DOI: 10.7270/Q200043M
3D
3D Structure (crystal)
17-beta-Hydroxysteroid Dehydrogenase 5 (17-beta-HSD5, AKR1C3)
(Homo sapiens (Human))
BDBM50396690
(CHEMBL2172078)
Show SMILES OC(=O)[C@@H]1CCCN(C1)S(=O)(=O)c1ccc2ccccc2c1 |r|
Show InChI InChI=1S/C16H17NO4S/c18-16(19)14-6-3-9-17(11-14)22(20,21)15-8-7-12-4-1-2-5-13(12)10-15/h1-2,4-5,7-8,10,14H,3,6,9,11H2,(H,18,19)/t14-/m1/s1
n/an/a 32n/an/an/an/an/an/a
University of Auckland
Curated by ChEMBL
Assay Description
Inhibition of human recombinant N-terminal His6-tagged AKR1C3 expressed in Escherichia coli BL21(DE3) cells using 8-Acetyl-2,3,5,6-tetrahydro-1H,4H-1...
J Med Chem 55: 7746-58 (2012)
Article DOI: 10.1021/jm3007867
BindingDB Entry DOI: 10.7270/Q28K7B6F
3D
3D Structure (crystal)
Aldo-keto-reductase family 1 member C3
(Homo sapiens (Human))
BDBM50396690
(CHEMBL2172078)
Show SMILES OC(=O)[C@@H]1CCCN(C1)S(=O)(=O)c1ccc2ccccc2c1 |r|
Show InChI InChI=1S/C16H17NO4S/c18-16(19)14-6-3-9-17(11-14)22(20,21)15-8-7-12-4-1-2-5-13(12)10-15/h1-2,4-5,7-8,10,14H,3,6,9,11H2,(H,18,19)/t14-/m1/s1
n/an/a 32n/an/an/an/an/an/a
Guangzhou Medical University
Curated by ChEMBL
Assay Description
Inhibition of human recombinant His-tagged AKR1C3 expressed in Escherichia coli BL21 (DE3) cells using 8-Acetyl-2,3,5,6-tetrahydro-1H,4H-11-oxa-3a-az...
Bioorg Med Chem Lett 26: 5631-5638 (2016)
Article DOI: 10.1016/j.bmcl.2016.10.073
BindingDB Entry DOI: 10.7270/Q200043M
3D
3D Structure (crystal)
Aldo-keto reductase family 1 member C1
(Homo sapiens (Human))
BDBM50396690
(CHEMBL2172078)
Show SMILES OC(=O)[C@@H]1CCCN(C1)S(=O)(=O)c1ccc2ccccc2c1 |r|
Show InChI InChI=1S/C16H17NO4S/c18-16(19)14-6-3-9-17(11-14)22(20,21)15-8-7-12-4-1-2-5-13(12)10-15/h1-2,4-5,7-8,10,14H,3,6,9,11H2,(H,18,19)/t14-/m1/s1
Reactome pathway
n/an/a>3.00E+4n/an/an/an/an/an/a
University of Auckland
Curated by ChEMBL
Assay Description
Inhibition of human recombinant N-terminal His6-tagged AKR1C1 expressed in Escherichia coli BL21(DE3) cells using 8-Acetyl-2,3,5,6-tetrahydro-1H,4H-1...
J Med Chem 55: 7746-58 (2012)
Article DOI: 10.1021/jm3007867
BindingDB Entry DOI: 10.7270/Q28K7B6F
3D
3D Structure (crystal)