BDBM50396695 CHEMBL2172121
SMILES: OC(=O)c1cccc(c1)S(=O)(=O)N1CCc2cc(Cl)ccc2C1
InChI Key: InChIKey=JCJYYFVNWSPXEZ-UHFFFAOYSA-N
Data: 7 IC50
Activity Spreadsheet -- Enzyme Inhibition Constant Data from BindingDB
Found 7 hits for monomerid = 50396695
Trg + Lig
Ki
nM
ΔG°
kcal/mole
IC50
nM
Kd
nM
EC50/IC50
nM
koff
s-1
kon
M-1s-1
pHTemp
°C
17-beta-Hydroxysteroid Dehydrogenase 5 (17-beta-HSD5, AKR1C3)
(Homo sapiens (Human))
BDBM50396695
(CHEMBL2172121)
Show SMILES OC(=O)c1cccc(c1)S(=O)(=O)N1CCc2cc(Cl)ccc2C1
Show InChI InChI=1S/C16H14ClNO4S/c17-14-5-4-13-10-18(7-6-11(13)8-14)23(21,22)15-3-1-2-12(9-15)16(19)20/h1-5,8-9H,6-7,10H2,(H,19,20)
n/an/a 8.70n/an/an/an/an/an/a
University of Auckland
Curated by ChEMBL
Assay Description
Inhibition of human recombinant N-terminal His6-tagged AKR1C3 expressed in Escherichia coli BL21(DE3) cells using 8-Acetyl-2,3,5,6-tetrahydro-1H,4H-1...
J Med Chem 55: 7746-58 (2012)
Article DOI: 10.1021/jm3007867
BindingDB Entry DOI: 10.7270/Q28K7B6F
Aldo-keto reductase family 1 member C4 (AK1C4)
(Homo sapiens (Human))
BDBM50396695
(CHEMBL2172121)
Show SMILES OC(=O)c1cccc(c1)S(=O)(=O)N1CCc2cc(Cl)ccc2C1
Show InChI InChI=1S/C16H14ClNO4S/c17-14-5-4-13-10-18(7-6-11(13)8-14)23(21,22)15-3-1-2-12(9-15)16(19)20/h1-5,8-9H,6-7,10H2,(H,19,20)
n/an/a>3.00E+4n/an/an/an/an/an/a
University of Auckland
Curated by ChEMBL
Assay Description
Inhibition of human recombinant N-terminal His6-tagged AKR1C4 expressed in Escherichia coli BL21(DE3) cells using 8-Acetyl-2,3,5,6-tetrahydro-1H,4H-1...
J Med Chem 55: 7746-58 (2012)
Article DOI: 10.1021/jm3007867
BindingDB Entry DOI: 10.7270/Q28K7B6F
Aldo-keto reductase family 1 member C2
(Homo sapiens (Human))
BDBM50396695
(CHEMBL2172121)
Show SMILES OC(=O)c1cccc(c1)S(=O)(=O)N1CCc2cc(Cl)ccc2C1
Show InChI InChI=1S/C16H14ClNO4S/c17-14-5-4-13-10-18(7-6-11(13)8-14)23(21,22)15-3-1-2-12(9-15)16(19)20/h1-5,8-9H,6-7,10H2,(H,19,20)
Reactome pathway
n/an/a>3.00E+4n/an/an/an/an/an/a
University of Auckland
Curated by ChEMBL
Assay Description
Inhibition of human recombinant N-terminal His6-tagged AKR1C2 expressed in Escherichia coli BL21(DE3) cells using 8-Acetyl-2,3,5,6-tetrahydro-1H,4H-1...
J Med Chem 55: 7746-58 (2012)
Article DOI: 10.1021/jm3007867
BindingDB Entry DOI: 10.7270/Q28K7B6F
Aldo-keto-reductase family 1 member C3
(Homo sapiens (Human))
BDBM50396695
(CHEMBL2172121)
Show SMILES OC(=O)c1cccc(c1)S(=O)(=O)N1CCc2cc(Cl)ccc2C1
Show InChI InChI=1S/C16H14ClNO4S/c17-14-5-4-13-10-18(7-6-11(13)8-14)23(21,22)15-3-1-2-12(9-15)16(19)20/h1-5,8-9H,6-7,10H2,(H,19,20)
n/an/a 8.70n/an/an/an/an/an/a
Guangzhou Medical University
Curated by ChEMBL
Assay Description
Inhibition of human recombinant His-tagged AKR1C3 expressed in Escherichia coli BL21 (DE3) cells using 8-Acetyl-2,3,5,6-tetrahydro-1H,4H-11-oxa-3a-az...
Bioorg Med Chem Lett 26: 5631-5638 (2016)
Article DOI: 10.1016/j.bmcl.2016.10.073
BindingDB Entry DOI: 10.7270/Q200043M
17-beta-Hydroxysteroid Dehydrogenase 5 (17-beta-HSD5, AKR1C3)
(Homo sapiens (Human))
BDBM50396695
(CHEMBL2172121)
Show SMILES OC(=O)c1cccc(c1)S(=O)(=O)N1CCc2cc(Cl)ccc2C1
Show InChI InChI=1S/C16H14ClNO4S/c17-14-5-4-13-10-18(7-6-11(13)8-14)23(21,22)15-3-1-2-12(9-15)16(19)20/h1-5,8-9H,6-7,10H2,(H,19,20)
n/an/a 39n/an/an/an/an/an/a
University of Auckland
Curated by ChEMBL
Assay Description
Inhibition of AKR1C3 overexpressed in human HCT116 cells assessed as inhibition of PR-104A conversion to hydroxylamine after 2 hrs by spectrophotomet...
J Med Chem 55: 7746-58 (2012)
Article DOI: 10.1021/jm3007867
BindingDB Entry DOI: 10.7270/Q28K7B6F
17-beta-Hydroxysteroid Dehydrogenase 5 (17-beta-HSD5, AKR1C3)
(Homo sapiens (Human))
BDBM50396695
(CHEMBL2172121)
Show SMILES OC(=O)c1cccc(c1)S(=O)(=O)N1CCc2cc(Cl)ccc2C1
Show InChI InChI=1S/C16H14ClNO4S/c17-14-5-4-13-10-18(7-6-11(13)8-14)23(21,22)15-3-1-2-12(9-15)16(19)20/h1-5,8-9H,6-7,10H2,(H,19,20)
n/an/a 8.70n/an/an/an/an/an/a
Guangzhou Medical University
Curated by ChEMBL
Assay Description
Inhibition of human recombinant His-tagged AKR1C3 expressed in Escherichia coli BL21 (DE3) cells using 8-Acetyl-2,3,5,6-tetrahydro-1H,4H-11-oxa-3a-az...
Bioorg Med Chem Lett 26: 5631-5638 (2016)
Article DOI: 10.1016/j.bmcl.2016.10.073
BindingDB Entry DOI: 10.7270/Q200043M
Aldo-keto reductase family 1 member C1
(Homo sapiens (Human))
BDBM50396695
(CHEMBL2172121)
Show SMILES OC(=O)c1cccc(c1)S(=O)(=O)N1CCc2cc(Cl)ccc2C1
Show InChI InChI=1S/C16H14ClNO4S/c17-14-5-4-13-10-18(7-6-11(13)8-14)23(21,22)15-3-1-2-12(9-15)16(19)20/h1-5,8-9H,6-7,10H2,(H,19,20)
Reactome pathway
n/an/a 7.48E+3n/an/an/an/an/an/a
University of Auckland
Curated by ChEMBL
Assay Description
Inhibition of human recombinant N-terminal His6-tagged AKR1C1 expressed in Escherichia coli BL21(DE3) cells using 8-Acetyl-2,3,5,6-tetrahydro-1H,4H-1...
J Med Chem 55: 7746-58 (2012)
Article DOI: 10.1021/jm3007867
BindingDB Entry DOI: 10.7270/Q28K7B6F