BDBM50396774 CHEMBL2172380
SMILES: OC[C@H]1O[C@]2(OCc3ccc(Cc4ccc(F)cc4)cc23)[C@H](O)[C@@H](O)[C@@H]1O
InChI Key: InChIKey=ZHSQCWICOOMBIT-OBKDMQGPSA-N
Data: 2 IC50
Activity Spreadsheet -- Enzyme Inhibition Constant Data from BindingDB
Found 2 hits for monomerid = 50396774
Trg + Lig
Ki
nM
ΔG°
kcal/mole
IC50
nM
Kd
nM
EC50/IC50
nM
koff
s-1
kon
M-1s-1
pHTemp
°C
Sodium/glucose cotransporter 2
(Homo sapiens (Human))
BDBM50396774
(CHEMBL2172380)
Show SMILES OC[C@H]1O[C@]2(OCc3ccc(Cc4ccc(F)cc4)cc23)[C@H](O)[C@@H](O)[C@@H]1O |r|
Show InChI InChI=1S/C20H21FO6/c21-14-5-2-11(3-6-14)7-12-1-4-13-10-26-20(15(13)8-12)19(25)18(24)17(23)16(9-22)27-20/h1-6,8,16-19,22-25H,7,9-10H2/t16-,17-,18+,19-,20+/m1/s1
n/an/a 123n/an/an/an/an/an/a
Chugai Pharmaceutical Co., Ltd.
Curated by ChEMBL
Assay Description
Inhibition of human SGLT2 expressed in CHO cells assessed as inhibition of sodium-dependent [14C]methyl-alpha-D-glucopyranoside uptake after 45 mins
J Med Chem 55: 7828-40 (2012)
Article DOI: 10.1021/jm300884k
BindingDB Entry DOI: 10.7270/Q2MW2J9K
Sodium/glucose cotransporter 1 (SGLT1)
(Homo sapiens (Human))
BDBM50396774
(CHEMBL2172380)
Show SMILES OC[C@H]1O[C@]2(OCc3ccc(Cc4ccc(F)cc4)cc23)[C@H](O)[C@@H](O)[C@@H]1O |r|
Show InChI InChI=1S/C20H21FO6/c21-14-5-2-11(3-6-14)7-12-1-4-13-10-26-20(15(13)8-12)19(25)18(24)17(23)16(9-22)27-20/h1-6,8,16-19,22-25H,7,9-10H2/t16-,17-,18+,19-,20+/m1/s1
n/an/a 1.87E+4n/an/an/an/an/an/a
Chugai Pharmaceutical Co., Ltd.
Curated by ChEMBL
Assay Description
Inhibition of human SGLT1 expressed in CHO cells assessed as inhibition of sodium-dependent [14C]methyl-alpha-D-glucopyranoside uptake after 45 mins
J Med Chem 55: 7828-40 (2012)
Article DOI: 10.1021/jm300884k
BindingDB Entry DOI: 10.7270/Q2MW2J9K