BDBM50396778 CHEMBL2172492
SMILES: CCCc1ccc(Cc2ccc3CO[C@]4(O[C@H](CO)[C@@H](O)[C@H](O)[C@H]4O)c3c2)cc1
InChI Key: InChIKey=HRORFBJWRPKYBM-ZQGJOIPISA-N
Data: 2 IC50
Activity Spreadsheet -- Enzyme Inhibition Constant Data from BindingDB
Found 2 hits for monomerid = 50396778
Trg + Lig
Ki
nM
ΔG°
kcal/mole
IC50
nM
Kd
nM
EC50/IC50
nM
koff
s-1
kon
M-1s-1
pHTemp
°C
Sodium/glucose cotransporter 2
(Homo sapiens (Human))
BDBM50396778
(CHEMBL2172492)
Show SMILES CCCc1ccc(Cc2ccc3CO[C@]4(O[C@H](CO)[C@@H](O)[C@H](O)[C@H]4O)c3c2)cc1 |r|
Show InChI InChI=1S/C23H28O6/c1-2-3-14-4-6-15(7-5-14)10-16-8-9-17-13-28-23(18(17)11-16)22(27)21(26)20(25)19(12-24)29-23/h4-9,11,19-22,24-27H,2-3,10,12-13H2,1H3/t19-,20-,21+,22-,23+/m1/s1
n/an/a 7.5n/an/an/an/an/an/a
Chugai Pharmaceutical Co., Ltd.
Curated by ChEMBL
Assay Description
Inhibition of human SGLT2 expressed in CHO cells assessed as inhibition of sodium-dependent [14C]methyl-alpha-D-glucopyranoside uptake after 45 mins
J Med Chem 55: 7828-40 (2012)
Article DOI: 10.1021/jm300884k
BindingDB Entry DOI: 10.7270/Q2MW2J9K
Sodium/glucose cotransporter 1 (SGLT1)
(Homo sapiens (Human))
BDBM50396778
(CHEMBL2172492)
Show SMILES CCCc1ccc(Cc2ccc3CO[C@]4(O[C@H](CO)[C@@H](O)[C@H](O)[C@H]4O)c3c2)cc1 |r|
Show InChI InChI=1S/C23H28O6/c1-2-3-14-4-6-15(7-5-14)10-16-8-9-17-13-28-23(18(17)11-16)22(27)21(26)20(25)19(12-24)29-23/h4-9,11,19-22,24-27H,2-3,10,12-13H2,1H3/t19-,20-,21+,22-,23+/m1/s1
n/an/a 1.31E+4n/an/an/an/an/an/a
Chugai Pharmaceutical Co., Ltd.
Curated by ChEMBL
Assay Description
Inhibition of human SGLT1 expressed in CHO cells assessed as inhibition of sodium-dependent [14C]methyl-alpha-D-glucopyranoside uptake after 45 mins
J Med Chem 55: 7828-40 (2012)
Article DOI: 10.1021/jm300884k
BindingDB Entry DOI: 10.7270/Q2MW2J9K