BDBM50396780 CHEMBL2172491
SMILES: Cc1ccc(Cc2ccc3CO[C@]4(O[C@H](CO)[C@@H](O)[C@H](O)[C@H]4O)c3c2)cc1
InChI Key: InChIKey=SHWWZRABJOMJNC-ADAARDCZSA-N
Data: 2 IC50
Activity Spreadsheet -- Enzyme Inhibition Constant Data from BindingDB
Found 2 hits for monomerid = 50396780
Trg + Lig
Ki
nM
ΔG°
kcal/mole
IC50
nM
Kd
nM
EC50/IC50
nM
koff
s-1
kon
M-1s-1
pHTemp
°C
Sodium/glucose cotransporter 2
(Homo sapiens (Human))
BDBM50396780
(CHEMBL2172491)
Show SMILES Cc1ccc(Cc2ccc3CO[C@]4(O[C@H](CO)[C@@H](O)[C@H](O)[C@H]4O)c3c2)cc1 |r|
Show InChI InChI=1S/C21H24O6/c1-12-2-4-13(5-3-12)8-14-6-7-15-11-26-21(16(15)9-14)20(25)19(24)18(23)17(10-22)27-21/h2-7,9,17-20,22-25H,8,10-11H2,1H3/t17-,18-,19+,20-,21+/m1/s1
n/an/a 4.80n/an/an/an/an/an/a
Chugai Pharmaceutical Co., Ltd.
Curated by ChEMBL
Assay Description
Inhibition of human SGLT2 expressed in CHO cells assessed as inhibition of sodium-dependent [14C]methyl-alpha-D-glucopyranoside uptake after 45 mins
J Med Chem 55: 7828-40 (2012)
Article DOI: 10.1021/jm300884k
BindingDB Entry DOI: 10.7270/Q2MW2J9K
Sodium/glucose cotransporter 1 (SGLT1)
(Homo sapiens (Human))
BDBM50396780
(CHEMBL2172491)
Show SMILES Cc1ccc(Cc2ccc3CO[C@]4(O[C@H](CO)[C@@H](O)[C@H](O)[C@H]4O)c3c2)cc1 |r|
Show InChI InChI=1S/C21H24O6/c1-12-2-4-13(5-3-12)8-14-6-7-15-11-26-21(16(15)9-14)20(25)19(24)18(23)17(10-22)27-21/h2-7,9,17-20,22-25H,8,10-11H2,1H3/t17-,18-,19+,20-,21+/m1/s1
n/an/a 3.09E+3n/an/an/an/an/an/a
Chugai Pharmaceutical Co., Ltd.
Curated by ChEMBL
Assay Description
Inhibition of human SGLT1 expressed in CHO cells assessed as inhibition of sodium-dependent [14C]methyl-alpha-D-glucopyranoside uptake after 45 mins
J Med Chem 55: 7828-40 (2012)
Article DOI: 10.1021/jm300884k
BindingDB Entry DOI: 10.7270/Q2MW2J9K