BDBM50396901 CHEMBL2170701
SMILES: CC(C)C[C@H](NC(=O)[C@H](CC(C)C)NC(=O)[C@@H](Cc1c[nH]c2ccccc12)NC(=O)[C@H](Cc1ccccc1)NC(=O)[C@@H](Cc1cn(C)c2ccccc12)NC(=O)[C@@H](N)CCCCN)C(N)=O
InChI Key: InChIKey=AHWBBFQVXUUXQV-KBWIMFBDSA-N
Data: 1 KI  1 EC50
Activity Spreadsheet -- Enzyme Inhibition Constant Data from BindingDB
Found 2 hits for monomerid = 50396901
Trg + Lig
Ki
nM
ΔG°
kcal/mole
IC50
nM
Kd
nM
EC50/IC50
nM
koff
s-1
kon
M-1s-1
pHTemp
°C
Ghrelin receptor
(Homo sapiens (Human))
BDBM50396901
(CHEMBL2170701)
Show SMILES CC(C)C[C@H](NC(=O)[C@H](CC(C)C)NC(=O)[C@@H](Cc1c[nH]c2ccccc12)NC(=O)[C@H](Cc1ccccc1)NC(=O)[C@@H](Cc1cn(C)c2ccccc12)NC(=O)[C@@H](N)CCCCN)C(N)=O |r|
Show InChI InChI=1S/C50H68N10O6/c1-30(2)23-39(45(53)61)55-47(63)40(24-31(3)4)57-49(65)42(26-33-28-54-38-20-11-9-17-35(33)38)59-48(64)41(25-32-15-7-6-8-16-32)58-50(66)43(56-46(62)37(52)19-13-14-22-51)27-34-29-60(5)44-21-12-10-18-36(34)44/h6-12,15-18,20-21,28-31,37,39-43,54H,13-14,19,22-27,51-52H2,1-5H3,(H2,53,61)(H,55,63)(H,56,62)(H,57,65)(H,58,66)(H,59,64)/t37-,39-,40-,41-,42+,43+/m0/s1
Reactome pathway
22.1n/an/an/an/an/an/an/an/a
Universit£t Leipzig
Curated by ChEMBL
Assay Description
Displacement of [125I]-His-ghrelin from human ghrelin receptor expressed in COS7 cells incubated for 75 mins by scintillation counting based assay
J Med Chem 55: 7437-49 (2012)
Article DOI: 10.1021/jm300414b
BindingDB Entry DOI: 10.7270/Q26M37Z8
Ghrelin receptor
(Homo sapiens (Human))
BDBM50396901
(CHEMBL2170701)
Show SMILES CC(C)C[C@H](NC(=O)[C@H](CC(C)C)NC(=O)[C@@H](Cc1c[nH]c2ccccc12)NC(=O)[C@H](Cc1ccccc1)NC(=O)[C@@H](Cc1cn(C)c2ccccc12)NC(=O)[C@@H](N)CCCCN)C(N)=O |r|
Show InChI InChI=1S/C50H68N10O6/c1-30(2)23-39(45(53)61)55-47(63)40(24-31(3)4)57-49(65)42(26-33-28-54-38-20-11-9-17-35(33)38)59-48(64)41(25-32-15-7-6-8-16-32)58-50(66)43(56-46(62)37(52)19-13-14-22-51)27-34-29-60(5)44-21-12-10-18-36(34)44/h6-12,15-18,20-21,28-31,37,39-43,54H,13-14,19,22-27,51-52H2,1-5H3,(H2,53,61)(H,55,63)(H,56,62)(H,57,65)(H,58,66)(H,59,64)/t37-,39-,40-,41-,42+,43+/m0/s1
Reactome pathway
n/an/an/an/a>1.00E+3n/an/an/an/a
Universit£t Leipzig
Curated by ChEMBL
Assay Description
Activation of human ghrelin receptor expressed in COS 7 cells using [2-3H]myo-inositol by inositol triphosphate turnover assay
J Med Chem 55: 7437-49 (2012)
Article DOI: 10.1021/jm300414b
BindingDB Entry DOI: 10.7270/Q26M37Z8