BDBM50396952 CHEMBL2170968
SMILES: N#Cc1ccc(cc1)-c1cnc2nnc(Cc3c[nH]c4ncccc34)n2n1
InChI Key: InChIKey=JJWKCZCBEYPJAJ-UHFFFAOYSA-N
Data: 1 KI  1 IC50
PDB links: 1 PDB ID matches this monomer.
Activity Spreadsheet -- Enzyme Inhibition Constant Data from BindingDB
Found 2 hits for monomerid = 50396952
Trg + Lig
Ki
nM
ΔG°
kcal/mole
IC50
nM
Kd
nM
EC50/IC50
nM
koff
s-1
kon
M-1s-1
pHTemp
°C
Hepatocyte growth factor receptor
(Homo sapiens (Human))
BDBM50396952
(CHEMBL2170968)
Show SMILES N#Cc1ccc(cc1)-c1cnc2nnc(Cc3c[nH]c4ncccc34)n2n1
Show InChI InChI=1S/C19H12N8/c20-9-12-3-5-13(6-4-12)16-11-23-19-25-24-17(27(19)26-16)8-14-10-22-18-15(14)2-1-7-21-18/h1-7,10-11H,8H2,(H,21,22)
4n/an/an/an/an/an/an/an/a
Pfizer Inc.
Curated by ChEMBL
Assay Description
Competitive inhibition of N-terminal His6-tagged recombinant human c-MET (974 to 1390 amino acids) by spectrophotometry
J Med Chem 55: 8091-109 (2012)
Article DOI: 10.1021/jm300967g
BindingDB Entry DOI: 10.7270/Q2Z60Q59
3D
3D Structure (crystal)
Hepatocyte growth factor receptor
(Homo sapiens (Human))
BDBM50396952
(CHEMBL2170968)
Show SMILES N#Cc1ccc(cc1)-c1cnc2nnc(Cc3c[nH]c4ncccc34)n2n1
Show InChI InChI=1S/C19H12N8/c20-9-12-3-5-13(6-4-12)16-11-23-19-25-24-17(27(19)26-16)8-14-10-22-18-15(14)2-1-7-21-18/h1-7,10-11H,8H2,(H,21,22)
n/an/a 16n/an/an/an/an/an/a
Pfizer Inc.
Curated by ChEMBL
Assay Description
Antagonist activity at c-MET receptor in human A549 cells assessed as inhibition of autophosphorylation after 1 hr by ELISA
J Med Chem 55: 8091-109 (2012)
Article DOI: 10.1021/jm300967g
BindingDB Entry DOI: 10.7270/Q2Z60Q59
3D
3D Structure (crystal)