BDBM50397031 CHEMBL2171190
SMILES: [#8]-c1cc2ccccc2cc1-[#6](=O)-[#7]\[#7]=[#6]-1\[#6]=[#6]/[#6](/[#6]=[#6]-1)=[#7]\[#8]S(=O)(=O)c1ccccc1
InChI Key: InChIKey=RXNFTGOAZGNBAW-VEAPLJLUSA-N
Data: 2 KI  1 IC50
Activity Spreadsheet -- Enzyme Inhibition Constant Data from BindingDB
Found 3 hits for monomerid = 50397031
Trg + Lig
Ki
nM
ΔG°
kcal/mole
IC50
nM
Kd
nM
EC50/IC50
nM
koff
s-1
kon
M-1s-1
pHTemp
°C
Protein-arginine N-methyltransferase 1
(Homo sapiens (Human))
BDBM50397031
(CHEMBL2171190)
Show SMILES [#8]-c1cc2ccccc2cc1-[#6](=O)-[#7]\[#7]=[#6]-1\[#6]=[#6]/[#6](/[#6]=[#6]-1)=[#7]\[#8]S(=O)(=O)c1ccccc1 |c:18,21|
Show InChI InChI=1S/C23H17N3O5S/c27-22-15-17-7-5-4-6-16(17)14-21(22)23(28)25-24-18-10-12-19(13-11-18)26-31-32(29,30)20-8-2-1-3-9-20/h1-15,27H,(H,25,28)/b24-18-,26-19+
8.40E+3n/an/an/an/an/an/an/an/a
Georgia State University
Curated by ChEMBL
Assay Description
Competitive inhibition of histidine tagged recombinant PRMT1 expressed in Escherichia coli BL21 (DE3) cells assessed as Ki intercept using Histone H4...
J Med Chem 55: 7978-87 (2012)
Article DOI: 10.1021/jm300521m
BindingDB Entry DOI: 10.7270/Q2PN96R4
Protein-arginine N-methyltransferase 1
(Homo sapiens (Human))
BDBM50397031
(CHEMBL2171190)
Show SMILES [#8]-c1cc2ccccc2cc1-[#6](=O)-[#7]\[#7]=[#6]-1\[#6]=[#6]/[#6](/[#6]=[#6]-1)=[#7]\[#8]S(=O)(=O)c1ccccc1 |c:18,21|
Show InChI InChI=1S/C23H17N3O5S/c27-22-15-17-7-5-4-6-16(17)14-21(22)23(28)25-24-18-10-12-19(13-11-18)26-31-32(29,30)20-8-2-1-3-9-20/h1-15,27H,(H,25,28)/b24-18-,26-19+
>2.57E+5n/an/an/an/an/an/an/an/a
Georgia State University
Curated by ChEMBL
Assay Description
Non competitive inhibition of histidine tagged recombinant PRMT1 expressed in Escherichia coli BL21 (DE3) cells assessed as Ki slope using SAM preinc...
J Med Chem 55: 7978-87 (2012)
Article DOI: 10.1021/jm300521m
BindingDB Entry DOI: 10.7270/Q2PN96R4
Protein-arginine N-methyltransferase 1
(Homo sapiens (Human))
BDBM50397031
(CHEMBL2171190)
Show SMILES [#8]-c1cc2ccccc2cc1-[#6](=O)-[#7]\[#7]=[#6]-1\[#6]=[#6]/[#6](/[#6]=[#6]-1)=[#7]\[#8]S(=O)(=O)c1ccccc1 |c:18,21|
Show InChI InChI=1S/C23H17N3O5S/c27-22-15-17-7-5-4-6-16(17)14-21(22)23(28)25-24-18-10-12-19(13-11-18)26-31-32(29,30)20-8-2-1-3-9-20/h1-15,27H,(H,25,28)/b24-18-,26-19+
n/an/a 4.17E+4n/an/an/an/an/an/a
Georgia State University
Curated by ChEMBL
Assay Description
Inhibition of histidine tagged recombinant PRMT1 expressed in Escherichia coli BL21 (DE3) cells using Histone H4(1-20) substrate preincubated for 5 m...
J Med Chem 55: 7978-87 (2012)
Article DOI: 10.1021/jm300521m
BindingDB Entry DOI: 10.7270/Q2PN96R4