BDBM50397079 CHEMBL2171451
SMILES: COc1ccc(cc1OCCCCOc1ccc(cc1)C#N)C1=NN(C2CCCCCC2)C(=O)C1(C)C
InChI Key: InChIKey=WEJLERTVUATZDA-UHFFFAOYSA-N
Data: 1 IC50
Activity Spreadsheet -- Enzyme Inhibition Constant Data from BindingDB
Found 1 hit for monomerid = 50397079
Trg + Lig
Ki
nM
ΔG°
kcal/mole
IC50
nM
Kd
nM
EC50/IC50
nM
koff
s-1
kon
M-1s-1
pHTemp
°C
Class I phosphodiesterase B1 (TbrPDEB1)
(Trypanosoma brucei)
BDBM50397079
(CHEMBL2171451)
Show SMILES COc1ccc(cc1OCCCCOc1ccc(cc1)C#N)C1=NN(C2CCCCCC2)C(=O)C1(C)C |t:24|
Show InChI InChI=1S/C30H37N3O4/c1-30(2)28(32-33(29(30)34)24-10-6-4-5-7-11-24)23-14-17-26(35-3)27(20-23)37-19-9-8-18-36-25-15-12-22(21-31)13-16-25/h12-17,20,24H,4-11,18-19H2,1-3H3
n/an/a 160n/an/an/an/an/an/a
VU University Amsterdam
Curated by ChEMBL
Assay Description
Inhibition of Trypanosoma brucei recombinant TbrPDEB1 expressed in Sf21 insect cells assessed as reduction of [3H]-cAMP hydrolysis by scintillation p...
J Med Chem 55: 8745-56 (2012)
Article DOI: 10.1021/jm301059b
BindingDB Entry DOI: 10.7270/Q2SF2X96