BDBM50397343 CHEMBL2170135
SMILES: OC1=NC(=S)C(S1)=Cc1ccc(cc1)C([O-])=O
InChI Key: InChIKey=QYCZDJALECNZGD-UHFFFAOYSA-M
Data: 2 IC50
Activity Spreadsheet -- Enzyme Inhibition Constant Data from BindingDB
Found 2 hits for monomerid = 50397343
Trg + Lig
Ki
nM
ΔG°
kcal/mole
IC50
nM
Kd
nM
EC50/IC50
nM
koff
s-1
kon
M-1s-1
pHTemp
°C
Tyrosyl-DNA phosphodiesterase 1 (TDP1)
(Homo sapiens (Human))
BDBM50397343
(CHEMBL2170135)
Show SMILES OC1=NC(=S)C(S1)=Cc1ccc(cc1)C([O-])=O |w:7.8,t:1|
Show InChI InChI=1S/C11H7NO3S2/c13-10(14)7-3-1-6(2-4-7)5-8-9(16)12-11(15)17-8/h1-5H,(H,13,14)(H,12,15,16)/p-1
n/an/a 7.80E+3n/an/an/an/an/an/a
University of Minnesota
Curated by ChEMBL
Assay Description
Inhibition of human recombinant Tdp1 assessed as conversion of 14-mer 5'-32P-labeled 3'-phosphotyrosyl DNA substrate N14Y to 14-mer 5'-32P-labeled 3'...
J Med Chem 55: 8671-84 (2012)
Article DOI: 10.1021/jm3008773
BindingDB Entry DOI: 10.7270/Q2MP54D1
Tyrosyl-DNA phosphodiesterase 1 (TDP1)
(Homo sapiens (Human))
BDBM50397343
(CHEMBL2170135)
Show SMILES OC1=NC(=S)C(S1)=Cc1ccc(cc1)C([O-])=O |w:7.8,t:1|
Show InChI InChI=1S/C11H7NO3S2/c13-10(14)7-3-1-6(2-4-7)5-8-9(16)12-11(15)17-8/h1-5H,(H,13,14)(H,12,15,16)/p-1
n/an/a 6.90E+3n/an/an/an/an/an/a
University of Minnesota
Curated by ChEMBL
Assay Description
Inhibition of human recombinant Tdp1 expressed in Tdp1 knockout chicken DT40 cells using 5'-32P-labeled 5'-GATCTAAAAGACTT-pY-3' as substrate after 15...
J Med Chem 55: 8671-84 (2012)
Article DOI: 10.1021/jm3008773
BindingDB Entry DOI: 10.7270/Q2MP54D1