BDBM50397391 CHEMBL2170544
SMILES: CCCCCn1cc(C(=O)NC(C)C23CC4CC(CC(C4)C2)C3)c(=O)cc1C
InChI Key: InChIKey=BTWDWNAWMKULEG-UHFFFAOYSA-N
Data: 2 KI  1 EC50
Activity Spreadsheet -- Enzyme Inhibition Constant Data from BindingDB
Found 3 hits for monomerid = 50397391
Trg + Lig
Ki
nM
ΔG°
kcal/mole
IC50
nM
Kd
nM
EC50/IC50
nM
koff
s-1
kon
M-1s-1
pHTemp
°C
Cannabinoid receptor 2
(Homo sapiens (Human))
BDBM50397391
(CHEMBL2170544)
Show SMILES CCCCCn1cc(C(=O)NC(C)C23CC4CC(CC(C4)C2)C3)c(=O)cc1C |TLB:16:17:14.15.20:21,THB:16:15:21:22.17.18,18:17:14:20.19.21,18:19:14:22.16.17|
Show InChI InChI=1S/C24H36N2O2/c1-4-5-6-7-26-15-21(22(27)8-16(26)2)23(28)25-17(3)24-12-18-9-19(13-24)11-20(10-18)14-24/h8,15,17-20H,4-7,9-14H2,1-3H3,(H,25,28)
Reactome pathway
6.40n/an/an/an/an/an/an/an/a
Universit£ Lille Nord de France
Curated by ChEMBL
Assay Description
Displacement of [3H]-CP55940 from human recombinant CB2 receptor expressed in CHO cells membrane by scintillation counting
J Med Chem 55: 8948-52 (2012)
Article DOI: 10.1021/jm3008568
BindingDB Entry DOI: 10.7270/Q27H1KQS
Cannabinoid receptor 1
(Homo sapiens (Human))
BDBM50397391
(CHEMBL2170544)
Show SMILES CCCCCn1cc(C(=O)NC(C)C23CC4CC(CC(C4)C2)C3)c(=O)cc1C |TLB:16:17:14.15.20:21,THB:16:15:21:22.17.18,18:17:14:20.19.21,18:19:14:22.16.17|
Show InChI InChI=1S/C24H36N2O2/c1-4-5-6-7-26-15-21(22(27)8-16(26)2)23(28)25-17(3)24-12-18-9-19(13-24)11-20(10-18)14-24/h8,15,17-20H,4-7,9-14H2,1-3H3,(H,25,28)
NCI pathway
Reactome pathway
>1.00E+3n/an/an/an/an/an/an/an/a
Universit£ Lille Nord de France
Curated by ChEMBL
Assay Description
Displacement of [3H]-CP55940 from human recombinant CB1 receptor expressed in CHO cells membrane by scintillation counting
J Med Chem 55: 8948-52 (2012)
Article DOI: 10.1021/jm3008568
BindingDB Entry DOI: 10.7270/Q27H1KQS
Cannabinoid receptor 2
(Homo sapiens (Human))
BDBM50397391
(CHEMBL2170544)
Show SMILES CCCCCn1cc(C(=O)NC(C)C23CC4CC(CC(C4)C2)C3)c(=O)cc1C |TLB:16:17:14.15.20:21,THB:16:15:21:22.17.18,18:17:14:20.19.21,18:19:14:22.16.17|
Show InChI InChI=1S/C24H36N2O2/c1-4-5-6-7-26-15-21(22(27)8-16(26)2)23(28)25-17(3)24-12-18-9-19(13-24)11-20(10-18)14-24/h8,15,17-20H,4-7,9-14H2,1-3H3,(H,25,28)
Reactome pathway
n/an/an/an/a 84.2n/an/an/an/a
Universit£ Lille Nord de France
Curated by ChEMBL
Assay Description
Agonist activity at human recombinant CB2 receptor expressed in CHO cells membrane by [35S]-GTPgammaS assay
J Med Chem 55: 8948-52 (2012)
Article DOI: 10.1021/jm3008568
BindingDB Entry DOI: 10.7270/Q27H1KQS