BDBM50397590 CHEMBL2171516
SMILES: Cc1cc(C)cc(c1)-c1ccc2nc(NC(=O)C3CCCCC3)nn2c1
InChI Key: InChIKey=UTEPOVQRHGZHJU-UHFFFAOYSA-N
Data: 1 IC50
Activity Spreadsheet -- Enzyme Inhibition Constant Data from BindingDB
Found 1 hit for monomerid = 50397590
Trg + Lig
Ki
nM
ΔG°
kcal/mole
IC50
nM
Kd
nM
EC50/IC50
nM
koff
s-1
kon
M-1s-1
pHTemp
°C
Cdc2-related kinase
(Leishmania major)
BDBM50397590
(CHEMBL2171516)
Show SMILES Cc1cc(C)cc(c1)-c1ccc2nc(NC(=O)C3CCCCC3)nn2c1
Show InChI InChI=1S/C21H24N4O/c1-14-10-15(2)12-18(11-14)17-8-9-19-22-21(24-25(19)13-17)23-20(26)16-6-4-3-5-7-16/h8-13,16H,3-7H2,1-2H3,(H,23,24,26)
n/an/a 20n/an/an/an/an/an/a
Montclair State University
Curated by ChEMBL
Assay Description
Inhibition of Leishmania major CRK3 expressed in Escherichia coli BL21 (DE3) using 5FAM-GGGRSPGRRRRK-OH as substrate after 60 mins by IMAP assay
Bioorg Med Chem Lett 22: 6788-93 (2012)
Article DOI: 10.1016/j.bmcl.2012.09.044
BindingDB Entry DOI: 10.7270/Q26H4JJZ