BDBM50397630 CHEMBL2181726
SMILES: Cc1noc(C)c1-c1ccc(C)c(c1)S(=O)(=O)Nc1ccccc1Cl
InChI Key: InChIKey=WGMAQYUYNQXUDX-UHFFFAOYSA-N
Data: 3 IC50
Activity Spreadsheet -- Enzyme Inhibition Constant Data from BindingDB
Found 3 hits for monomerid = 50397630
Trg + Lig
Ki
nM
ΔG°
kcal/mole
IC50
nM
Kd
nM
EC50/IC50
nM
koff
s-1
kon
M-1s-1
pHTemp
°C
Bromodomain-containing protein 4
(Homo sapiens (Human))
BDBM50397630
(CHEMBL2181726)
Show SMILES Cc1noc(C)c1-c1ccc(C)c(c1)S(=O)(=O)Nc1ccccc1Cl
Show InChI InChI=1S/C18H17ClN2O3S/c1-11-8-9-14(18-12(2)20-24-13(18)3)10-17(11)25(22,23)21-16-7-5-4-6-15(16)19/h4-10,21H,1-3H3
n/an/a 3.00E+3n/an/an/an/an/an/a
GlaxoSmithKline R&D
Curated by ChEMBL
Assay Description
Inhibition of His6-tagged BRD4-BD12 expressed in Escherichia coli assessed as inhibition of binding to SGRG-K(Ac)-GG-K(Ac)-GLG-K(Ac)-GGA-K(Ac)-RHGSGS...
J Med Chem 55: 587-96 (2012)
Article DOI: 10.1021/jm201283q
BindingDB Entry DOI: 10.7270/Q22R3SSS
Bromodomain-containing protein 2
(Homo sapiens (Human))
BDBM50397630
(CHEMBL2181726)
Show SMILES Cc1noc(C)c1-c1ccc(C)c(c1)S(=O)(=O)Nc1ccccc1Cl
Show InChI InChI=1S/C18H17ClN2O3S/c1-11-8-9-14(18-12(2)20-24-13(18)3)10-17(11)25(22,23)21-16-7-5-4-6-15(16)19/h4-10,21H,1-3H3
n/an/a 1.80E+3n/an/an/an/an/an/a
GlaxoSmithKline R&D
Curated by ChEMBL
Assay Description
Inhibition of His6-tagged BRD2 expressed in Escherichia coli assessed as inhibition of binding to SGRG-K(Ac)-GG-K(Ac)-GLG-K(Ac)-GGA-K(Ac)-RHGSGSK-bio...
J Med Chem 55: 587-96 (2012)
Article DOI: 10.1021/jm201283q
BindingDB Entry DOI: 10.7270/Q22R3SSS
Bromodomain-containing protein 3
(Homo sapiens (Human))
BDBM50397630
(CHEMBL2181726)
Show SMILES Cc1noc(C)c1-c1ccc(C)c(c1)S(=O)(=O)Nc1ccccc1Cl
Show InChI InChI=1S/C18H17ClN2O3S/c1-11-8-9-14(18-12(2)20-24-13(18)3)10-17(11)25(22,23)21-16-7-5-4-6-15(16)19/h4-10,21H,1-3H3
n/an/a 2.00E+3n/an/an/an/an/an/a
GlaxoSmithKline R&D
Curated by ChEMBL
Assay Description
Inhibition of His6-tagged BRD3 expressed in Escherichia coli assessed as inhibition of binding to SGRG-K(Ac)-GG-K(Ac)-GLG-K(Ac)-GGA-K(Ac)-RHGSGSK-bio...
J Med Chem 55: 587-96 (2012)
Article DOI: 10.1021/jm201283q
BindingDB Entry DOI: 10.7270/Q22R3SSS