BDBM50397738 CHEMBL2181998
SMILES: O=C(OC1CCOCC1)[C@H]1C[C@]2(CN1)C(=O)Nc1ccccc21
InChI Key: InChIKey=HIOAPSYSJQPIRC-RHSMWYFYSA-N
Data: 2 IC50
PDB links: 1 PDB ID matches this monomer.
Activity Spreadsheet -- Enzyme Inhibition Constant Data from BindingDB
Found 2 hits for monomerid = 50397738
Trg + Lig
Ki
nM
ΔG°
kcal/mole
IC50
nM
Kd
nM
EC50/IC50
nM
koff
s-1
kon
M-1s-1
pHTemp
°C
Beta-secretase 1
(Homo sapiens (Human))
BDBM50397738
(CHEMBL2181998)
Show SMILES O=C(OC1CCOCC1)[C@H]1C[C@]2(CN1)C(=O)Nc1ccccc21 |r|
Show InChI InChI=1S/C17H20N2O4/c20-15(23-11-5-7-22-8-6-11)14-9-17(10-18-14)12-3-1-2-4-13(12)19-16(17)21/h1-4,11,14,18H,5-10H2,(H,19,21)/t14-,17-/m1/s1
n/an/a 1.14E+5n/an/an/an/an/an/a
Pfizer Inc.
Curated by ChEMBL
Assay Description
Inhibition of human recombinant BACE1 using RGLTTRPGSGLTNIKTEEISEVNLDAEFRHDSGA as substrate after 1 hr by TMB-ELISA
J Med Chem 55: 9069-88 (2012)
Article DOI: 10.1021/jm201715d
BindingDB Entry DOI: 10.7270/Q21R6RND
3D
3D Structure (crystal)
Beta-secretase 1
(Homo sapiens (Human))
BDBM50397738
(CHEMBL2181998)
Show SMILES O=C(OC1CCOCC1)[C@H]1C[C@]2(CN1)C(=O)Nc1ccccc21 |r|
Show InChI InChI=1S/C17H20N2O4/c20-15(23-11-5-7-22-8-6-11)14-9-17(10-18-14)12-3-1-2-4-13(12)19-16(17)21/h1-4,11,14,18H,5-10H2,(H,19,21)/t14-,17-/m1/s1
n/an/a 3.20E+4n/an/an/an/an/an/a
Pfizer Inc.
Curated by ChEMBL
Assay Description
Inhibition of recombinant BACE1 using NH-SEVNLAAEF-COOH as substrate after 30 mins by NMR analysis
J Med Chem 55: 9069-88 (2012)
Article DOI: 10.1021/jm201715d
BindingDB Entry DOI: 10.7270/Q21R6RND
3D
3D Structure (crystal)