BDBM50397739 CHEMBL2181997
SMILES: COC(=O)[C@H]1C[C@]2(CN1)C(=O)Nc1ccccc21
InChI Key: InChIKey=WBRZAMFFUKWSQR-ZWNOBZJWSA-N
Data: 1 IC50
PDB links: 1 PDB ID matches this monomer.
Activity Spreadsheet -- Enzyme Inhibition Constant Data from BindingDB
Found 1 hit for monomerid = 50397739
Trg + Lig
Ki
nM
ΔG°
kcal/mole
IC50
nM
Kd
nM
EC50/IC50
nM
koff
s-1
kon
M-1s-1
pHTemp
°C
Beta-secretase 1
(Homo sapiens (Human))
BDBM50397739
(CHEMBL2181997)
Show SMILES COC(=O)[C@H]1C[C@]2(CN1)C(=O)Nc1ccccc21 |r|
Show InChI InChI=1S/C13H14N2O3/c1-18-11(16)10-6-13(7-14-10)8-4-2-3-5-9(8)15-12(13)17/h2-5,10,14H,6-7H2,1H3,(H,15,17)/t10-,13-/m1/s1
n/an/a 2.42E+5n/an/an/an/an/an/a
Pfizer Inc.
Curated by ChEMBL
Assay Description
Inhibition of recombinant BACE1 using NH-SEVNLAAEF-COOH as substrate after 30 mins by NMR analysis
J Med Chem 55: 9069-88 (2012)
Article DOI: 10.1021/jm201715d
BindingDB Entry DOI: 10.7270/Q21R6RND
3D
3D Structure (crystal)