null
SMILES: Fc1ccc(o1)C(=O)N1CC2CNCC2C1
InChI Key: InChIKey=YRJXIUNIRVSCPU-UHFFFAOYSA-N
Activity Spreadsheet -- Enzyme Inhibition Constant Data from BindingDB
Found 5 hits for monomerid = 50397893
Trg + Lig
Ki
nM
ΔG°
kcal/mole
IC50
nM
Kd
nM
EC50/IC50
nM
koff
s-1
kon
M-1s-1
pHTemp
°C
Neuronal acetylcholine receptor subunit alpha-4/beta-2
(Homo sapiens (Human))
BDBM50397893
(CHEMBL2179526)
Show SMILES Fc1ccc(o1)C(=O)N1CC2CNCC2C1
Show InChI InChI=1S/C11H13FN2O2/c12-10-2-1-9(16-10)11(15)14-5-7-3-13-4-8(7)6-14/h1-2,7-8,13H,3-6H2
NCI pathway
Reactome pathway
8n/an/an/an/an/an/an/an/a
Targacept, Inc.
Curated by ChEMBL
Assay Description
Displacement of [3H]nicotine from alpha4beta2 nAChR in human SH-EP1 cells after 2 hrs by liquid scintillation assay
J Med Chem 55: 9181-94 (2012)
Article DOI: 10.1021/jm3006542
BindingDB Entry DOI: 10.7270/Q2W0972W
Neuronal acetylcholine receptor subunit alpha-4
(Rattus norvegicus (Rat))
BDBM50397893
(CHEMBL2179526)
Show SMILES Fc1ccc(o1)C(=O)N1CC2CNCC2C1
Show InChI InChI=1S/C11H13FN2O2/c12-10-2-1-9(16-10)11(15)14-5-7-3-13-4-8(7)6-14/h1-2,7-8,13H,3-6H2
US Patent
8.30 -10.9n/an/an/an/an/an/a21
Targacept, Inc.
US Patent
Assay Description
The binding of [3H]MLA was measured using a modification of the methods of Davies et al., Neuropharmacol. 38: 679 (1999). [3H]MLA (Specific Activity=...
US Patent US8921410 (2014)
BindingDB Entry DOI: 10.7270/Q2QZ28PT
Neuronal acetylcholine receptor subunit alpha-4
(Homo sapiens (Human))
BDBM50397893
(CHEMBL2179526)
Show SMILES Fc1ccc(o1)C(=O)N1CC2CNCC2C1
Show InChI InChI=1S/C11H13FN2O2/c12-10-2-1-9(16-10)11(15)14-5-7-3-13-4-8(7)6-14/h1-2,7-8,13H,3-6H2
US Patent
16 -10.5n/an/an/an/an/an/a21
Targacept, Inc.
US Patent
Assay Description
The binding of [3H]MLA was measured using a modification of the methods of Davies et al., Neuropharmacol. 38: 679 (1999). [3H]MLA (Specific Activity=...
US Patent US8921410 (2014)
BindingDB Entry DOI: 10.7270/Q2QZ28PT
Neuronal acetylcholine receptor subunit alpha-7
(Homo sapiens (Human))
BDBM50397893
(CHEMBL2179526)
Show SMILES Fc1ccc(o1)C(=O)N1CC2CNCC2C1
Show InChI InChI=1S/C11H13FN2O2/c12-10-2-1-9(16-10)11(15)14-5-7-3-13-4-8(7)6-14/h1-2,7-8,13H,3-6H2
1.20E+3n/an/an/an/an/an/an/an/a
Targacept, Inc.
Curated by ChEMBL
Assay Description
Displacement of [3H]epibatidine from human alpha7 nAChR expressed in CHO cells after 2 hrs by liquid scintillation counting
J Med Chem 55: 9181-94 (2012)
Article DOI: 10.1021/jm3006542
BindingDB Entry DOI: 10.7270/Q2W0972W
Neuronal acetylcholine receptor subunit alpha-4/beta-2
(Homo sapiens (Human))
BDBM50397893
(CHEMBL2179526)
Show SMILES Fc1ccc(o1)C(=O)N1CC2CNCC2C1
Show InChI InChI=1S/C11H13FN2O2/c12-10-2-1-9(16-10)11(15)14-5-7-3-13-4-8(7)6-14/h1-2,7-8,13H,3-6H2
NCI pathway
Reactome pathway
n/an/an/an/a 5.80E+3n/an/an/an/a
Targacept, Inc.
Curated by ChEMBL
Assay Description
Agonist activity at alpha4beta2 nAChR in human SH-EP1 cells assessed as calcium flux by calcium4-based FLIPR assay
J Med Chem 55: 9181-94 (2012)
Article DOI: 10.1021/jm3006542
BindingDB Entry DOI: 10.7270/Q2W0972W