BDBM50397904 CHEMBL2179961
SMILES: O=C(C1CC1)N1CC2CNCC2C1
InChI Key: InChIKey=OEWOQZPDLZUIGU-UHFFFAOYSA-N
Data: 4 KI  2 EC50
Activity Spreadsheet -- Enzyme Inhibition Constant Data from BindingDB
Found 6 hits for monomerid = 50397904
Trg + Lig
Ki
nM
ΔG°
kcal/mole
IC50
nM
Kd
nM
EC50/IC50
nM
koff
s-1
kon
M-1s-1
pHTemp
°C
Neuronal acetylcholine receptor Alpha-4/Beta-2
(Homo sapiens (Human))
BDBM50397904
(CHEMBL2179961)
Show SMILES O=C(C1CC1)N1CC2CNCC2C1
Show InChI InChI=1S/C10H16N2O/c13-10(7-1-2-7)12-5-8-3-11-4-9(8)6-12/h7-9,11H,1-6H2
NCI pathway
Reactome pathway
4n/an/an/an/an/an/an/an/a
Targacept, Inc.
Curated by ChEMBL
Assay Description
Displacement of [3H]Nicotine from alpha4beta2 nACHR in human SHEP1 cell membranes after 2 hrs by liquid scintillation counting analysis
Bioorg Med Chem Lett 23: 3927-34 (2013)
Article DOI: 10.1016/j.bmcl.2013.04.058
BindingDB Entry DOI: 10.7270/Q279462S
Neuronal acetylcholine receptor Alpha-4/Beta-2
(Homo sapiens (Human))
BDBM50397904
(CHEMBL2179961)
Show SMILES O=C(C1CC1)N1CC2CNCC2C1
Show InChI InChI=1S/C10H16N2O/c13-10(7-1-2-7)12-5-8-3-11-4-9(8)6-12/h7-9,11H,1-6H2
NCI pathway
Reactome pathway
4n/an/an/an/an/an/an/an/a
Targacept, Inc.
Curated by ChEMBL
Assay Description
Displacement of [3H]nicotine from alpha4beta2 nAChR in human SH-EP1 cells after 2 hrs by liquid scintillation assay
J Med Chem 55: 9181-94 (2012)
Article DOI: 10.1021/jm3006542
BindingDB Entry DOI: 10.7270/Q2W0972W
Neuronal acetylcholine receptor protein alpha-7 subunit
(Homo sapiens (Human))
BDBM50397904
(CHEMBL2179961)
Show SMILES O=C(C1CC1)N1CC2CNCC2C1
Show InChI InChI=1S/C10H16N2O/c13-10(7-1-2-7)12-5-8-3-11-4-9(8)6-12/h7-9,11H,1-6H2
840n/an/an/an/an/an/an/an/a
Targacept, Inc.
Curated by ChEMBL
Assay Description
Displacement of [3H]epibatidine from human alpha7 nAChR expressed in CHO cells after 2 hrs by liquid scintillation counting
J Med Chem 55: 9181-94 (2012)
Article DOI: 10.1021/jm3006542
BindingDB Entry DOI: 10.7270/Q2W0972W
Neuronal acetylcholine receptor protein alpha-7 subunit
(Homo sapiens (Human))
BDBM50397904
(CHEMBL2179961)
Show SMILES O=C(C1CC1)N1CC2CNCC2C1
Show InChI InChI=1S/C10H16N2O/c13-10(7-1-2-7)12-5-8-3-11-4-9(8)6-12/h7-9,11H,1-6H2
840n/an/an/an/an/an/an/an/a
Targacept, Inc.
Curated by ChEMBL
Assay Description
Displacement of [3H]Epibatidine from human alpha7 nACHR expressed in CHO cell membranes after 2 hrs by liquid scintillation counting analysis
Bioorg Med Chem Lett 23: 3927-34 (2013)
Article DOI: 10.1016/j.bmcl.2013.04.058
BindingDB Entry DOI: 10.7270/Q279462S
Neuronal acetylcholine receptor Alpha-4/Beta-2
(Homo sapiens (Human))
BDBM50397904
(CHEMBL2179961)
Show SMILES O=C(C1CC1)N1CC2CNCC2C1
Show InChI InChI=1S/C10H16N2O/c13-10(7-1-2-7)12-5-8-3-11-4-9(8)6-12/h7-9,11H,1-6H2
NCI pathway
Reactome pathway
n/an/an/an/a 470n/an/an/an/a
Targacept, Inc.
Curated by ChEMBL
Assay Description
Agonist activity at alpha4beta2 nAChR in human SH-EP1 cells assessed as calcium flux by calcium4-based FLIPR assay
J Med Chem 55: 9181-94 (2012)
Article DOI: 10.1021/jm3006542
BindingDB Entry DOI: 10.7270/Q2W0972W
Neuronal acetylcholine receptor Alpha-4/Beta-2
(Homo sapiens (Human))
BDBM50397904
(CHEMBL2179961)
Show SMILES O=C(C1CC1)N1CC2CNCC2C1
Show InChI InChI=1S/C10H16N2O/c13-10(7-1-2-7)12-5-8-3-11-4-9(8)6-12/h7-9,11H,1-6H2
NCI pathway
Reactome pathway
n/an/an/an/a 470n/an/an/an/a
Targacept, Inc.
Curated by ChEMBL
Assay Description
Agonist activity at alpha4beta2 nACHR in human SHEP1 cell membranes assessed as stimulation of calcium flux by FLIPR assay
Bioorg Med Chem Lett 23: 3927-34 (2013)
Article DOI: 10.1016/j.bmcl.2013.04.058
BindingDB Entry DOI: 10.7270/Q279462S