BDBM50397987 CHEMBL2180452
SMILES: CC(=O)N1CCCC(C1)c1cccnc1Oc1ccc(cc1)C(=O)c1nc2ccccc2[nH]1
InChI Key: InChIKey=WWFTWZCLJUHLBP-UHFFFAOYSA-N
Data: 1 IC50
Activity Spreadsheet -- Enzyme Inhibition Constant Data from BindingDB
Found 1 hit for monomerid = 50397987
Trg + Lig
Ki
nM
ΔG°
kcal/mole
IC50
nM
Kd
nM
EC50/IC50
nM
koff
s-1
kon
M-1s-1
pHTemp
°C
cAMP and cAMP-inhibited cGMP 3',5'-cyclic phosphodiesterase 10A
(Homo sapiens (Human))
BDBM50397987
(CHEMBL2180452)
Show SMILES CC(=O)N1CCCC(C1)c1cccnc1Oc1ccc(cc1)C(=O)c1nc2ccccc2[nH]1
Show InChI InChI=1S/C26H24N4O3/c1-17(31)30-15-5-6-19(16-30)21-7-4-14-27-26(21)33-20-12-10-18(11-13-20)24(32)25-28-22-8-2-3-9-23(22)29-25/h2-4,7-14,19H,5-6,15-16H2,1H3,(H,28,29)
Reactome pathway
n/an/a 0.0500n/an/an/an/an/an/a
Pfizer Inc.
Curated by ChEMBL
Assay Description
Inhibition of PDE10A
J Med Chem 55: 7299-331 (2012)
Article DOI: 10.1021/jm3004976
BindingDB Entry DOI: 10.7270/Q2C24XJK