BDBM50398113 CHEMBL2182040
SMILES: C[C@@H](OC(=O)Nc1cnnn1-c1ccc(cc1)-c1ccc(cc1)C1(CC1)C(O)=O)c1ccccc1
InChI Key: InChIKey=JBJOXXMKJMCKEL-GOSISDBHSA-N
Data: 1 IC50
Activity Spreadsheet -- Enzyme Inhibition Constant Data from BindingDB
Found 1 hit for monomerid = 50398113
Trg + Lig
Ki
nM
ΔG°
kcal/mole
IC50
nM
Kd
nM
EC50/IC50
nM
koff
s-1
kon
M-1s-1
pHTemp
°C
Lysophosphatidic acid receptor 1
(Homo sapiens (Human))
BDBM50398113
(CHEMBL2182040)
Show SMILES C[C@@H](OC(=O)Nc1cnnn1-c1ccc(cc1)-c1ccc(cc1)C1(CC1)C(O)=O)c1ccccc1 |r|
Show InChI InChI=1S/C27H24N4O4/c1-18(19-5-3-2-4-6-19)35-26(34)29-24-17-28-30-31(24)23-13-9-21(10-14-23)20-7-11-22(12-8-20)27(15-16-27)25(32)33/h2-14,17-18H,15-16H2,1H3,(H,29,34)(H,32,33)/t18-/m1/s1
n/an/a 36n/an/an/an/an/an/a
Hoffmann-La Roche
Curated by ChEMBL
Assay Description
Antagonist activity at human recombinant LPA1 expressed in chem-1 cells assessed as inhibition of LPA-induced intracellular calcium mobilization incu...
J Med Chem 55: 7920-39 (2012)
Article DOI: 10.1021/jm301022v
BindingDB Entry DOI: 10.7270/Q26974Q9