BDBM50398118 CHEMBL2182035
SMILES: CC(OC(=O)Nc1c(C)nnn1-c1ccc(cc1)-c1ccc(cc1)C1(CC1)C(O)=O)C1CCC1
InChI Key: InChIKey=SBJZFGASZPMUOO-UHFFFAOYSA-N
Data: 1 IC50
Activity Spreadsheet -- Enzyme Inhibition Constant Data from BindingDB
Found 1 hit for monomerid = 50398118
Trg + Lig
Ki
nM
ΔG°
kcal/mole
IC50
nM
Kd
nM
EC50/IC50
nM
koff
s-1
kon
M-1s-1
pHTemp
°C
Lysophosphatidic acid receptor 1
(Homo sapiens (Human))
BDBM50398118
(CHEMBL2182035)
Show SMILES CC(OC(=O)Nc1c(C)nnn1-c1ccc(cc1)-c1ccc(cc1)C1(CC1)C(O)=O)C1CCC1
Show InChI InChI=1S/C26H28N4O4/c1-16-23(27-25(33)34-17(2)18-4-3-5-18)30(29-28-16)22-12-8-20(9-13-22)19-6-10-21(11-7-19)26(14-15-26)24(31)32/h6-13,17-18H,3-5,14-15H2,1-2H3,(H,27,33)(H,31,32)
n/an/a 161n/an/an/an/an/an/a
Hoffmann-La Roche
Curated by ChEMBL
Assay Description
Antagonist activity at human recombinant LPA1 expressed in chem-1 cells assessed as inhibition of LPA-induced intracellular calcium mobilization incu...
J Med Chem 55: 7920-39 (2012)
Article DOI: 10.1021/jm301022v
BindingDB Entry DOI: 10.7270/Q26974Q9