BDBM50398197 CHEMBL1738933
SMILES: CO[C@H]([C@H](O)[C@@H](O)[C@H](O)\C=C\C(C)(C)C)C(=O)NC1Cc2ccccc2C1
InChI Key: InChIKey=XTHOIFAGDPGJPZ-PQQJDVFMSA-N
Data: 1 IC50
PDB links: 3 PDB IDs match this monomer.
Activity Spreadsheet -- Enzyme Inhibition Constant Data from BindingDB
Found 1 hit for monomerid = 50398197
Trg + Lig
Ki
nM
ΔG°
kcal/mole
IC50
nM
Kd
nM
EC50/IC50
nM
koff
s-1
kon
M-1s-1
pHTemp
°C
Methionine Aminopeptidase Type 1 (MetAP1)
(Homo sapiens (Human))
BDBM50398197
(CHEMBL1738933)
Show SMILES CO[C@H]([C@H](O)[C@@H](O)[C@H](O)\C=C\C(C)(C)C)C(=O)NC1Cc2ccccc2C1 |r|
Show InChI InChI=1S/C21H31NO5/c1-21(2,3)10-9-16(23)17(24)18(25)19(27-4)20(26)22-15-11-13-7-5-6-8-14(13)12-15/h5-10,15-19,23-25H,11-12H2,1-4H3,(H,22,26)/b10-9+/t16-,17+,18-,19-/m1/s1
Reactome pathway
n/an/a 5.58E+3n/an/an/an/an/an/a
Indiana University School of Medicine
Curated by ChEMBL
Assay Description
Inhibition of Mn(II) form of human methionine aminopeptidase1 expressed in Escherichia coli at 100 mM
J Med Chem 55: 8021-7 (2012)
Article DOI: 10.1021/jm3008695
BindingDB Entry DOI: 10.7270/Q2T43V72
3D
3D Structure (crystal)